{"text_format":"3","workbook":"xlsx","n_sheets":10,"sheets":["Лист1","Лист2","Лист3","Лист4","Лист5","Лист6","Лист7","Лист8","Лист9","Лист10"],"not_rendered":{"defined_names":1},"read":"whole","date_system":"1900"}

{"sheet":"Лист1","index":0,"n_rows":77,"n_cols":11,"rows_kept":77,"merged":[[0,0,0,10],[42,0,42,10],[43,0,43,10],[44,0,44,10],[45,0,45,10],[46,0,46,10],[73,0,73,10],[74,0,74,10],[75,0,75,10],[76,0,76,10]]}
["МБДОУ №32 \"Радуга\" с. Тюрнясево. 10.04.17"]
[null,1,2,3,4,5,6,7,8,9,10]
["Фамилия, имя ребенка","Пискунов Александр","Рахмонбердиева Анита","Фомина Виктория","Янаева Екатерина"]
["Дата рождения","2010-09-23","2010-12-06","2010-06-12","2011-03-22"]
["I. Зрительно-моторная координация"]
["узор №1"]
["графомоторные навыки",4,3,4,4]
["установление закономерностей",4,1,4,4]
["узор №2"]
["графомоторные навыки",3,2,4,1]
["установление закономерностей",4,1,4,1]
["узор №3"]
["графомоторные навыки",2,1,2,1]
["установление закономерностей",2,2,4,1]
["самоконтроль ",4,1,4,1]
["II. Математические представления"]
["Счет",3,4,4,3]
["Сравнение",4,4,4,4]
["Приведение к равенству",4,4,4,4]
["III. Мыслительные процессы"]
["Классификация",4,4,1,2]
["Исключение лишнего",3,4,4,4]
["IV. Звукобуквенный анализ, синтез, фонематическое восприятие"]
["Звукобуквенный анализ",4,3,4,4]
["Фонематическое восприятие",4,4,4,4]
["Звуковой синтез",3,3,4,3]
["V. Саморегуляция и организация деятельности"]
["Саморегуляция",4,3,4,4]
["самоконтроль ",1,4,4,4]
["VI. Внимание"]
["Пробы на внимание",4,4,4,4]
[]
[null,{"$f":"B3","v":"Пискунов Александр"},{"$f":"C3","v":"Рахмонбердиева Анита"},{"$f":"D3","v":"Фомина Виктория"},{"$f":"E3","v":"Янаева Екатерина"},0,0,0,0,0,0]
["I. Зрительно-моторная координация",{"$f":"(B7+B10+B13)/3","v":{"v":3,"d":"3.00"}},{"v":2,"d":"2.00"},{"v":3.3333333333333335,"d":"3.33"},{"v":2,"d":"2.00"},{"v":0,"d":"0.00"},{"v":0,"d":"0.00"},{"v":0,"d":"0.00"},{"v":0,"d":"0.00"},{"v":0,"d":"0.00"},{"v":0,"d":"0.00"}]
["II. Математические представления",{"$f":"(B17+B18+B19)/3","v":{"v":3.6666666666666665,"d":"3.67"}},{"$f":"(C17+C18+C19)/3","v":{"v":4,"d":"4.00"}},{"v":4,"d":"4.00"},{"v":3.6666666666666665,"d":"3.67"},{"v":0,"d":"0.00"},{"v":0,"d":"0.00"},{"v":0,"d":"0.00"},{"v":0,"d":"0.00"},{"v":0,"d":"0.00"},{"v":0,"d":"0.00"}]
["III. Мыслительные процессы",{"$f":"(B8+B11+B14+B21+B22)/5","v":{"v":3.4,"d":"3.40"}},{"v":2.4,"d":"2.40"},{"v":3.4,"d":"3.40"},{"v":2.4,"d":"2.40"},{"v":0,"d":"0.00"},{"v":0,"d":"0.00"},{"v":0,"d":"0.00"},{"v":0,"d":"0.00"},{"v":0,"d":"0.00"},{"v":0,"d":"0.00"}]
["IV. Звукобуквенный анализ, синтез, фонематическое восприятие",{"$f":"(B24+B25+B26)/3","v":{"v":3.6666666666666665,"d":"3.67"}},{"$f":"(C24+C25+C26)/3","v":{"v":3.3333333333333335,"d":"3.33"}},{"$f":"(D24+D25+D26)/3","v":{"v":4,"d":"4.00"}},{"v":3.6666666666666665,"d":"3.67"},{"v":0,"d":"0.00"},{"v":0,"d":"0.00"},{"v":0,"d":"0.00"},{"v":0,"d":"0.00"},{"v":0,"d":"0.00"},{"v":0,"d":"0.00"}]
["V. Саморегуляция и организация деятельности",{"$f":"(B15+B28+B29)/3","v":{"v":3,"d":"3.00"}},{"$f":"(C15+C28+C29)/3","v":{"v":2.6666666666666665,"d":"2.67"}},{"v":4,"d":"4.00"},{"v":3,"d":"3.00"},{"v":0,"d":"0.00"},{"v":0,"d":"0.00"},{"v":0,"d":"0.00"},{"v":0,"d":"0.00"},{"v":0,"d":"0.00"},{"v":0,"d":"0.00"}]
["VI. Внимание",{"$f":"B31","v":{"v":4,"d":"4.00"}},{"$f":"C31","v":{"v":4,"d":"4.00"}},{"v":4,"d":"4.00"},{"v":4,"d":"4.00"},{"v":0,"d":"0.00"},{"v":0,"d":"0.00"},{"v":0,"d":"0.00"},{"v":0,"d":"0.00"},{"v":0,"d":"0.00"},{"v":0,"d":"0.00"}]
["ИТОГО",{"$f":"(B34+B35+B36+B37+B38+B39)/6","v":{"v":3.4555555555555557,"d":"3.46"}},{"v":3.0666666666666664,"d":"3.07"},{"v":3.788888888888889,"d":"3.79"},{"v":3.1222222222222222,"d":"3.12"},{"v":0,"d":"0.00"},{"v":0,"d":"0.00"},{"v":0,"d":"0.00"},{"v":0,"d":"0.00"},{"v":0,"d":"0.00"},{"v":0,"d":"0.00"}]
[null,{"$f":"IF(B40>3.19,\"IV уровень\",IF(AND(B40<=3.19,B40>=2.5),\"III уровень\",IF(AND(B40<2.5,B40>=2),\"II уровень\",IF(AND(B40<1.99),\"I уровень\"))))","v":"IV уровень"},{"$f":"IF(C40>3.19,\"IV уровень\",IF(AND(C40<=3.19,C40>=2.5),\"III уровень\",IF(AND(C40<2.5,C40>=2),\"II уровень\",IF(AND(C40<1.99),\"I уровень\"))))","v":"III уровень"},"IV уровень","III уровень","I уровень","I уровень","I уровень","I уровень","I уровень","I уровень"]
[]
["4 уровень - высокие показатели состояния ВПФ и процессов (средний балл от 3,2 до 4,0) - ребенок не нуждается в проведении специальных коррекционных мероприятий."]
["3 уровень - показатели   средние (средний балл от 2,5 до 3,19) - ребенок не нуждается в проведении специальных коррекционных мероприятий, однако педагогом могут быть даны рекомендации по развивающей работе."]
["2 уровень -   показатели ниже средних (средний балл от 2,0 до 2,49) - ребенок нуждается в проведении специальных коррекционных мероприятий в виде групповых  и индивидуальных занятий."]
[" 1 уровень - низкие показатели(средний балл менее 2) - ребенок нуждается в проведении специальных коррекционных мероприятий в виде индивидуальных занятий."]
[{"$f":"A1","v":"МБДОУ №32 \"Радуга\" с. Тюрнясево. 10.04.17"}]
[null,{"$f":"B2","v":1},2,3,4,5,6,7,8,9,10]
["Фамилия, имя ребенка",{"$f":"B3","v":"Пискунов Александр"},{"$f":"C3","v":"Рахмонбердиева Анита"},"Фомина Виктория","Янаева Екатерина",0,0,0,0,0,0]
["Дата рождения",{"$f":"B4","v":"2010-09-23"},{"$f":"C4","v":"2010-12-06"},"2010-06-12","2011-03-22","00:00:00","00:00:00","00:00:00","00:00:00","00:00:00","00:00:00"]
["сформированность регуляторного компонента деятельности "]
["Задание 1",{"$f":"B31","v":{"v":4,"d":"4.00"}},{"$f":"C31","v":{"v":4,"d":"4.00"}},{"$f":"D31","v":{"v":4,"d":"4.00"}},{"v":4,"d":"4.00"},{"v":0,"d":"0.00"},{"v":0,"d":"0.00"},{"v":0,"d":"0.00"},{"v":0,"d":"0.00"},{"v":0,"d":"0.00"},{"v":0,"d":"0.00"}]
["Задание 3",{"$f":"(B28+B29)/2","v":{"v":2.5,"d":"2.50"}},{"$f":"(C28+C29)/2","v":{"v":3.5,"d":"3.50"}},{"$f":"(D28+D29)/2","v":{"v":4,"d":"4.00"}},{"v":4,"d":"4.00"},{"v":0,"d":"0.00"},{"v":0,"d":"0.00"},{"v":0,"d":"0.00"},{"v":0,"d":"0.00"},{"v":0,"d":"0.00"},{"v":0,"d":"0.00"}]
["Задание 4",{"$f":"B15","v":{"v":4,"d":"4.00"}},{"$f":"C15","v":{"v":1,"d":"1.00"}},{"$f":"D15","v":{"v":4,"d":"4.00"}},{"v":1,"d":"1.00"},{"v":0,"d":"0.00"},{"v":0,"d":"0.00"},{"v":0,"d":"0.00"},{"v":0,"d":"0.00"},{"v":0,"d":"0.00"},{"v":0,"d":"0.00"}]
["Задание 5",{"$f":"B19","v":{"v":4,"d":"4.00"}},{"$f":"C19","v":{"v":4,"d":"4.00"}},{"$f":"D19","v":{"v":4,"d":"4.00"}},{"v":4,"d":"4.00"},{"v":0,"d":"0.00"},{"v":0,"d":"0.00"},{"v":0,"d":"0.00"},{"v":0,"d":"0.00"},{"v":0,"d":"0.00"},{"v":0,"d":"0.00"}]
["сформированность предпосылок к учебной деятельности"]
["Задание 2",{"$f":"B26","v":{"v":3,"d":"3.00"}},{"$f":"C26","v":{"v":3,"d":"3.00"}},{"$f":"D26","v":{"v":4,"d":"4.00"}},{"v":3,"d":"3.00"},{"v":0,"d":"0.00"},{"v":0,"d":"0.00"},{"v":0,"d":"0.00"},{"v":0,"d":"0.00"},{"v":0,"d":"0.00"},{"v":0,"d":"0.00"}]
["Задание 5",{"$f":"B35","v":{"v":3.6666666666666665,"d":"3.67"}},{"$f":"C35","v":{"v":4,"d":"4.00"}},{"$f":"D35","v":{"v":4,"d":"4.00"}},{"v":3.6666666666666665,"d":"3.67"},{"v":0,"d":"0.00"},{"v":0,"d":"0.00"},{"v":0,"d":"0.00"},{"v":0,"d":"0.00"},{"v":0,"d":"0.00"},{"v":0,"d":"0.00"}]
["Задание 8",{"$f":"B24","v":{"v":4,"d":"4.00"}},{"$f":"C24","v":{"v":3,"d":"3.00"}},{"$f":"D24","v":{"v":4,"d":"4.00"}},{"v":4,"d":"4.00"},{"v":0,"d":"0.00"},{"v":0,"d":"0.00"},{"v":0,"d":"0.00"},{"v":0,"d":"0.00"},{"v":0,"d":"0.00"},{"v":0,"d":"0.00"}]
["Задание 9",{"$f":"B25","v":{"v":4,"d":"4.00"}},{"$f":"C25","v":{"v":4,"d":"4.00"}},{"v":4,"d":"4.00"},{"v":4,"d":"4.00"},{"v":0,"d":"0.00"},{"v":0,"d":"0.00"},{"v":0,"d":"0.00"},{"v":0,"d":"0.00"},{"v":0,"d":"0.00"},{"v":0,"d":"0.00"}]
["сформированности пространственных представлений"]
["Задание 4",{"$f":"(B7+B10+B13)/3","v":{"v":3,"d":"3.00"}},{"$f":"(C7+C10+C13)/3","v":{"v":2,"d":"2.00"}},{"$f":"(D7+D10+D13)/3","v":{"v":3.3333333333333335,"d":"3.33"}},{"v":2,"d":"2.00"},{"v":0,"d":"0.00"},{"v":0,"d":"0.00"},{"v":0,"d":"0.00"},{"v":0,"d":"0.00"},{"v":0,"d":"0.00"},{"v":0,"d":"0.00"}]
["особенности мыслительной деятельности "]
["Задание 4 (закономерности)",{"$f":"(B8+B11+B14)/3","v":{"v":3.3333333333333335,"d":"3.33"}},{"$f":"(C8+C11+C14)/3","v":{"v":1.3333333333333333,"d":"1.33"}},{"$f":"(D8+D11+D14)/3","v":{"v":4,"d":"4.00"}},{"v":2,"d":"2.00"},{"v":0,"d":"0.00"},{"v":0,"d":"0.00"},{"v":0,"d":"0.00"},{"v":0,"d":"0.00"},{"v":0,"d":"0.00"},{"v":0,"d":"0.00"}]
["Задание 6",{"$f":"B21","v":{"v":4,"d":"4.00"}},{"$f":"C21","v":{"v":4,"d":"4.00"}},{"$f":"D21","v":{"v":1,"d":"1.00"}},{"v":2,"d":"2.00"},{"v":0,"d":"0.00"},{"v":0,"d":"0.00"},{"v":0,"d":"0.00"},{"v":0,"d":"0.00"},{"v":0,"d":"0.00"},{"v":0,"d":"0.00"}]
["Задание 7",{"$f":"B22","v":{"v":3,"d":"3.00"}},{"$f":"C22","v":{"v":4,"d":"4.00"}},{"v":4,"d":"4.00"},{"v":4,"d":"4.00"},{"v":0,"d":"0.00"},{"v":0,"d":"0.00"},{"v":0,"d":"0.00"},{"v":0,"d":"0.00"},{"v":0,"d":"0.00"},{"v":0,"d":"0.00"}]
[]
["сформированность регуляторного компонента деятельности ",{"$f":"(B52+B28+B29+B54+B55)/5","v":{"v":3.4,"d":"3.40"}},{"v":3.2,"d":"3.20"},{"v":4,"d":"4.00"},{"v":3.4,"d":"3.40"},{"v":0,"d":"0.00"},{"v":0,"d":"0.00"},{"v":0,"d":"0.00"},{"v":0,"d":"0.00"},{"v":0,"d":"0.00"},{"v":0,"d":"0.00"}]
["сформированность предпосылок к учебной деятельности",{"$f":"(B57+B17+B18+B19+B59+B60)/6","v":{"v":3.6666666666666665,"d":"3.67"}},{"v":3.6666666666666665,"d":"3.67"},{"v":4,"d":"4.00"},{"v":3.6666666666666665,"d":"3.67"},{"v":0,"d":"0.00"},{"v":0,"d":"0.00"},{"v":0,"d":"0.00"},{"v":0,"d":"0.00"},{"v":0,"d":"0.00"},{"v":0,"d":"0.00"}]
["сформированности пространственных представлений",{"$f":"B62","v":{"v":3,"d":"3.00"}},{"$f":"C62","v":{"v":2,"d":"2.00"}},{"$f":"D62","v":{"v":3.3333333333333335,"d":"3.33"}},{"v":2,"d":"2.00"},{"v":0,"d":"0.00"},{"v":0,"d":"0.00"},{"v":0,"d":"0.00"},{"v":0,"d":"0.00"},{"v":0,"d":"0.00"},{"v":0,"d":"0.00"}]
["особенности мыслительной деятельности ",{"$f":"(B8+B11+B14+B21+B22)/5","v":{"v":3.4,"d":"3.40"}},{"$f":"(C8+C11+C14+C21+C22)/5","v":{"v":2.4,"d":"2.40"}},{"$f":"(D8+D11+D14+D21+D22)/5","v":{"v":3.4,"d":"3.40"}},{"v":2.4,"d":"2.40"},{"v":0,"d":"0.00"},{"v":0,"d":"0.00"},{"v":0,"d":"0.00"},{"v":0,"d":"0.00"},{"v":0,"d":"0.00"},{"v":0,"d":"0.00"}]
[null,{"$f":"(B68+B69+B70+B71)/4","v":{"v":3.3666666666666667,"d":"3.37"}},{"$f":"(C68+C69+C70+C71)/4","v":{"v":2.816666666666667,"d":"2.82"}},{"$f":"(D68+D69+D70+D71)/4","v":{"v":3.6833333333333336,"d":"3.68"}},{"v":2.8666666666666667,"d":"2.87"},{"v":0,"d":"0.00"},{"v":0,"d":"0.00"},{"v":0,"d":"0.00"},{"v":0,"d":"0.00"},{"v":0,"d":"0.00"},{"v":0,"d":"0.00"}]
[null,{"$f":"IF(B72>3.19,\"готов\",IF(AND(B72<=3.19,B72>=2.5),\"готов\",IF(AND(B72<2.5,B72>=2),\"частично готов\",IF(AND(B72<2),\"не готов\"))))","v":"готов"},{"$f":"IF(C72>3.19,\"готов\",IF(AND(C72<=3.19,C72>=2.5),\"готов\",IF(AND(C72<2.5,C72>=2),\"частично готов\",IF(AND(C72<2),\"не готов\"))))","v":"готов"},"готов","готов","не готов","не готов","не готов","не готов","не готов","не готов"]
["4 уровень - высокие показатели готовности(средний балл от 3,2 до 4,0)"]
["3 уровень - показатели   готовности средние (средний балл от 2,50 до 3,19) "]
["2 уровень -   показатели готовности ниже средних (средний балл от 2,0 до 2,49)"]
[" 1 уровень - низкие показатели готовности (средний балл менее 2) "]

{"sheet":"Лист2","index":1,"n_rows":79,"n_cols":11,"rows_kept":79,"merged":[[0,0,0,10],[43,0,43,10],[44,0,44,10],[45,0,45,10],[46,0,46,10],[48,0,48,10],[75,0,75,10],[76,0,76,10],[77,0,77,10],[78,0,78,10]]}
["Итоги групповой диагностики   обучающихся (воспитанников) ОУ______________ _________"]
[null,11,12,13,14,15,16,17,18,19,20]
["Фамилия, имя ребенка"]
["Дата рождения"]
["I. Зрительно-моторная координация"]
["узор №1"]
["графомоторные навыки"]
["установление закономерностей"]
["узор №2"]
["графомоторные навыки"]
["установление закономерностей"]
["узор №3"]
["графомоторные навыки"]
["установление закономерностей"]
["самоконтроль "]
["II. Математические представления"]
["Счет"]
["Сравнение"]
["Приведение к равенству"]
["III. Мыслительные процессы"]
["Классификация"]
["Исключение лишнего"]
["IV. Звукобуквенный анализ, синтез, фонематическое восприятие"]
["Звукобуквенный анализ"]
["Фонематическое восприятие"]
["Звуковой синтез"]
["V. Саморегуляция и организация деятельности"]
["Саморегуляция"]
["самоконтроль "]
["VI. Внимание"]
["Пробы на внимание"]
[]
[null,{"$f":"B3","v":0},{"$f":"C3","v":0},{"$f":"D3","v":0},{"$f":"E3","v":0},0,0,0,0,0,0]
["I. Зрительно-моторная координация",{"$f":"(B7+B10+B13)/3","v":{"v":0,"d":"0.00"}},{"v":0,"d":"0.00"},{"v":0,"d":"0.00"},{"v":0,"d":"0.00"},{"v":0,"d":"0.00"},{"v":0,"d":"0.00"},{"v":0,"d":"0.00"},{"v":0,"d":"0.00"},{"v":0,"d":"0.00"},{"v":0,"d":"0.00"}]
["II. Математические представления",{"$f":"(B17+B18+B19)/3","v":{"v":0,"d":"0.00"}},{"$f":"(C17+C18+C19)/3","v":{"v":0,"d":"0.00"}},{"v":0,"d":"0.00"},{"v":0,"d":"0.00"},{"v":0,"d":"0.00"},{"v":0,"d":"0.00"},{"v":0,"d":"0.00"},{"v":0,"d":"0.00"},{"v":0,"d":"0.00"},{"v":0,"d":"0.00"}]
["III. Мыслительные процессы",{"$f":"(B8+B11+B14+B21+B22)/5","v":{"v":0,"d":"0.00"}},{"v":0,"d":"0.00"},{"v":0,"d":"0.00"},{"v":0,"d":"0.00"},{"v":0,"d":"0.00"},{"v":0,"d":"0.00"},{"v":0,"d":"0.00"},{"v":0,"d":"0.00"},{"v":0,"d":"0.00"},{"v":0,"d":"0.00"}]
["IV. Звукобуквенный анализ, синтез, фонематическое восприятие",{"$f":"(B24+B25+B26)/3","v":{"v":0,"d":"0.00"}},{"$f":"(C24+C25+C26)/3","v":{"v":0,"d":"0.00"}},{"$f":"(D24+D25+D26)/3","v":{"v":0,"d":"0.00"}},{"v":0,"d":"0.00"},{"v":0,"d":"0.00"},{"v":0,"d":"0.00"},{"v":0,"d":"0.00"},{"v":0,"d":"0.00"},{"v":0,"d":"0.00"},{"v":0,"d":"0.00"}]
["V. Саморегуляция и организация деятельности",{"$f":"(B15+B28+B29)/3","v":{"v":0,"d":"0.00"}},{"$f":"(C15+C28+C29)/3","v":{"v":0,"d":"0.00"}},{"v":0,"d":"0.00"},{"v":0,"d":"0.00"},{"v":0,"d":"0.00"},{"v":0,"d":"0.00"},{"v":0,"d":"0.00"},{"v":0,"d":"0.00"},{"v":0,"d":"0.00"},{"v":0,"d":"0.00"}]
["VI. Внимание",{"$f":"B31","v":{"v":0,"d":"0.00"}},{"$f":"C31","v":{"v":0,"d":"0.00"}},{"v":0,"d":"0.00"},{"v":0,"d":"0.00"},{"v":0,"d":"0.00"},{"v":0,"d":"0.00"},{"v":0,"d":"0.00"},{"v":0,"d":"0.00"},{"v":0,"d":"0.00"},{"v":0,"d":"0.00"}]
["ИТОГО",{"$f":"(B34+B35+B36+B37+B38+B39)/6","v":{"v":0,"d":"0.00"}},{"v":0,"d":"0.00"},{"v":0,"d":"0.00"},{"v":0,"d":"0.00"},{"v":0,"d":"0.00"},{"v":0,"d":"0.00"},{"v":0,"d":"0.00"},{"v":0,"d":"0.00"},{"v":0,"d":"0.00"},{"v":0,"d":"0.00"}]
[null,{"$f":"IF(B40>3.19,\"IV уровень\",IF(AND(B40<=3.19,B40>=2.5),\"III уровень\",IF(AND(B40<2.5,B40>=2),\"II уровень\",IF(AND(B40<1.99),\"I уровень\"))))","v":"I уровень"},"I уровень","I уровень","I уровень","I уровень","I уровень","I уровень","I уровень","I уровень","I уровень"]
[]
[]
["4 уровень - высокие показатели состояния ВПФ и процессов (средний балл от 3,2 до 4,0) - ребенок не нуждается в проведении специальных коррекционных мероприятий."]
["3 уровень - показатели   средние (средний балл от 2,5 до 3,19) - ребенок не нуждается в проведении специальных коррекционных мероприятий, однако педагогом могут быть даны рекомендации по развивающей работе."]
["2 уровень -   показатели ниже средних (средний балл от 2,0 до 2,49) - ребенок нуждается в проведении специальных коррекционных мероприятий в виде групповых  и индивидуальных занятий."]
[" 1 уровень - низкие показатели(средний балл менее 2) - ребенок нуждается в проведении специальных коррекционных мероприятий в виде индивидуальных занятий."]
[]
[{"$f":"A1","v":"Итоги групповой диагностики   обучающихся (воспитанников) ОУ______________ _________"}]
[null,{"$f":"B2","v":11},12,13,14,15,16,17,18,19,20]
["Фамилия, имя ребенка",{"$f":"B3","v":0},{"$f":"C3","v":0},0,0,0,0,0,0,0,0]
["Дата рождения",{"$f":"B4","v":"00:00:00"},{"$f":"C4","v":"00:00:00"},"00:00:00","00:00:00","00:00:00","00:00:00","00:00:00","00:00:00","00:00:00","00:00:00"]
["сформированность регуляторного компонента деятельности "]
["Задание 1",{"$f":"B31","v":{"v":0,"d":"0.00"}},{"$f":"C31","v":{"v":0,"d":"0.00"}},{"$f":"D31","v":{"v":0,"d":"0.00"}},{"v":0,"d":"0.00"},{"v":0,"d":"0.00"},{"v":0,"d":"0.00"},{"v":0,"d":"0.00"},{"v":0,"d":"0.00"},{"v":0,"d":"0.00"},{"v":0,"d":"0.00"}]
["Задание 3",{"$f":"(B28+B29)/2","v":{"v":0,"d":"0.00"}},{"$f":"(C28+C29)/2","v":{"v":0,"d":"0.00"}},{"$f":"(D28+D29)/2","v":{"v":0,"d":"0.00"}},{"v":0,"d":"0.00"},{"v":0,"d":"0.00"},{"v":0,"d":"0.00"},{"v":0,"d":"0.00"},{"v":0,"d":"0.00"},{"v":0,"d":"0.00"},{"v":0,"d":"0.00"}]
["Задание 4",{"$f":"B15","v":{"v":0,"d":"0.00"}},{"$f":"C15","v":{"v":0,"d":"0.00"}},{"$f":"D15","v":{"v":0,"d":"0.00"}},{"v":0,"d":"0.00"},{"v":0,"d":"0.00"},{"v":0,"d":"0.00"},{"v":0,"d":"0.00"},{"v":0,"d":"0.00"},{"v":0,"d":"0.00"},{"v":0,"d":"0.00"}]
["Задание 5",{"$f":"B19","v":{"v":0,"d":"0.00"}},{"$f":"C19","v":{"v":0,"d":"0.00"}},{"$f":"D19","v":{"v":0,"d":"0.00"}},{"v":0,"d":"0.00"},{"v":0,"d":"0.00"},{"v":0,"d":"0.00"},{"v":0,"d":"0.00"},{"v":0,"d":"0.00"},{"v":0,"d":"0.00"},{"v":0,"d":"0.00"}]
["сформированность предпосылок к учебной деятельности"]
["Задание 2",{"$f":"B26","v":{"v":0,"d":"0.00"}},{"$f":"C26","v":{"v":0,"d":"0.00"}},{"$f":"D26","v":{"v":0,"d":"0.00"}},{"v":0,"d":"0.00"},{"v":0,"d":"0.00"},{"v":0,"d":"0.00"},{"v":0,"d":"0.00"},{"v":0,"d":"0.00"},{"v":0,"d":"0.00"},{"v":0,"d":"0.00"}]
["Задание 5",{"$f":"B35","v":{"v":0,"d":"0.00"}},{"$f":"C35","v":{"v":0,"d":"0.00"}},{"$f":"D35","v":{"v":0,"d":"0.00"}},{"v":0,"d":"0.00"},{"v":0,"d":"0.00"},{"v":0,"d":"0.00"},{"v":0,"d":"0.00"},{"v":0,"d":"0.00"},{"v":0,"d":"0.00"},{"v":0,"d":"0.00"}]
["Задание 8",{"$f":"B24","v":{"v":0,"d":"0.00"}},{"$f":"C24","v":{"v":0,"d":"0.00"}},{"$f":"D24","v":{"v":0,"d":"0.00"}},{"v":0,"d":"0.00"},{"v":0,"d":"0.00"},{"v":0,"d":"0.00"},{"v":0,"d":"0.00"},{"v":0,"d":"0.00"},{"v":0,"d":"0.00"},{"v":0,"d":"0.00"}]
["Задание 9",{"$f":"B25","v":{"v":0,"d":"0.00"}},{"$f":"C25","v":{"v":0,"d":"0.00"}},{"v":0,"d":"0.00"},{"v":0,"d":"0.00"},{"v":0,"d":"0.00"},{"v":0,"d":"0.00"},{"v":0,"d":"0.00"},{"v":0,"d":"0.00"},{"v":0,"d":"0.00"},{"v":0,"d":"0.00"}]
["сформированности пространственных представлений"]
["Задание 4",{"$f":"(B7+B10+B13)/3","v":{"v":0,"d":"0.00"}},{"$f":"(C7+C10+C13)/3","v":{"v":0,"d":"0.00"}},{"$f":"(D7+D10+D13)/3","v":{"v":0,"d":"0.00"}},{"v":0,"d":"0.00"},{"v":0,"d":"0.00"},{"v":0,"d":"0.00"},{"v":0,"d":"0.00"},{"v":0,"d":"0.00"},{"v":0,"d":"0.00"},{"v":0,"d":"0.00"}]
["особенности мыслительной деятельности "]
["Задание 4 (закономерности)",{"$f":"(B8+B11+B14)/3","v":{"v":0,"d":"0.00"}},{"$f":"(C8+C11+C14)/3","v":{"v":0,"d":"0.00"}},{"$f":"(D8+D11+D14)/3","v":{"v":0,"d":"0.00"}},{"v":0,"d":"0.00"},{"v":0,"d":"0.00"},{"v":0,"d":"0.00"},{"v":0,"d":"0.00"},{"v":0,"d":"0.00"},{"v":0,"d":"0.00"},{"v":0,"d":"0.00"}]
["Задание 6",{"$f":"B21","v":{"v":0,"d":"0.00"}},{"$f":"C21","v":{"v":0,"d":"0.00"}},{"$f":"D21","v":{"v":0,"d":"0.00"}},{"v":0,"d":"0.00"},{"v":0,"d":"0.00"},{"v":0,"d":"0.00"},{"v":0,"d":"0.00"},{"v":0,"d":"0.00"},{"v":0,"d":"0.00"},{"v":0,"d":"0.00"}]
["Задание 7",{"$f":"B22","v":{"v":0,"d":"0.00"}},{"$f":"C22","v":{"v":0,"d":"0.00"}},{"v":0,"d":"0.00"},{"v":0,"d":"0.00"},{"v":0,"d":"0.00"},{"v":0,"d":"0.00"},{"v":0,"d":"0.00"},{"v":0,"d":"0.00"},{"v":0,"d":"0.00"},{"v":0,"d":"0.00"}]
[]
["сформированность регуляторного компонента деятельности ",{"$f":"(B54+B28+B29+B56+B57)/5","v":{"v":0,"d":"0.00"}},{"$f":"(C54+C28+C29+C56+C57)/5","v":{"v":0,"d":"0.00"}},{"$f":"(D54+D28+D29+D56+D57)/5","v":{"v":0,"d":"0.00"}},{"v":0,"d":"0.00"},{"v":0,"d":"0.00"},{"v":0,"d":"0.00"},{"v":0,"d":"0.00"},{"v":0,"d":"0.00"},{"v":0,"d":"0.00"},{"v":0,"d":"0.00"}]
["сформированность предпосылок к учебной деятельности",{"$f":"(B59+B17+B18+B19+B61+B62)/6","v":{"v":0,"d":"0.00"}},{"$f":"(C59+C17+C18+C19+C61+C62)/6","v":{"v":0,"d":"0.00"}},{"$f":"(D59+D17+D18+D19+D61+D62)/6","v":{"v":0,"d":"0.00"}},{"v":0,"d":"0.00"},{"v":0,"d":"0.00"},{"v":0,"d":"0.00"},{"v":0,"d":"0.00"},{"v":0,"d":"0.00"},{"v":0,"d":"0.00"},{"v":0,"d":"0.00"}]
["сформированности пространственных представлений",{"$f":"B64","v":{"v":0,"d":"0.00"}},{"$f":"C64","v":{"v":0,"d":"0.00"}},{"$f":"D64","v":{"v":0,"d":"0.00"}},{"v":0,"d":"0.00"},{"v":0,"d":"0.00"},{"v":0,"d":"0.00"},{"v":0,"d":"0.00"},{"v":0,"d":"0.00"},{"v":0,"d":"0.00"},{"v":0,"d":"0.00"}]
["особенности мыслительной деятельности ",{"$f":"(B8+B11+B14+B21+B22)/5","v":{"v":0,"d":"0.00"}},{"$f":"(C8+C11+C14+C21+C22)/5","v":{"v":0,"d":"0.00"}},{"$f":"(D8+D11+D14+D21+D22)/5","v":{"v":0,"d":"0.00"}},{"v":0,"d":"0.00"},{"v":0,"d":"0.00"},{"v":0,"d":"0.00"},{"v":0,"d":"0.00"},{"v":0,"d":"0.00"},{"v":0,"d":"0.00"},{"v":0,"d":"0.00"}]
[null,{"$f":"(B70+B71+B72+B73)/4","v":{"v":0,"d":"0.00"}},{"$f":"(C70+C71+C72+C73)/4","v":{"v":0,"d":"0.00"}},{"$f":"(D70+D71+D72+D73)/4","v":{"v":0,"d":"0.00"}},{"v":0,"d":"0.00"},{"v":0,"d":"0.00"},{"v":0,"d":"0.00"},{"v":0,"d":"0.00"},{"v":0,"d":"0.00"},{"v":0,"d":"0.00"},{"v":0,"d":"0.00"}]
[null,{"$f":"IF(B74>3.19,\"готов\",IF(AND(B74<=3.19,B74>=2.5),\"готов\",IF(AND(B74<2.5,B74>=2),\"частично готов\",IF(AND(B74<2),\"не готов\"))))","v":"не готов"},{"$f":"IF(C74>3.19,\"готов\",IF(AND(C74<=3.19,C74>=2.5),\"готов\",IF(AND(C74<2.5,C74>=2),\"частично готов\",IF(AND(C74<2),\"не готов\"))))","v":"не готов"},"не готов","не готов","не готов","не готов","не готов","не готов","не готов","не готов"]
["4 уровень - высокие показатели готовности(средний балл от 3,2 до 4,0)"]
["3 уровень - показатели   готовности средние (средний балл от 2,50 до 3,19) "]
["2 уровень -   показатели готовности ниже средних (средний балл от 2,0 до 2,49)"]
[" 1 уровень - низкие показатели готовности (средний балл менее 2) "]

{"sheet":"Лист3","index":2,"n_rows":79,"n_cols":11,"rows_kept":79,"merged":[[0,0,0,10],[43,0,43,10],[44,0,44,10],[45,0,45,10],[46,0,46,10],[48,0,48,10],[75,0,75,10],[76,0,76,10],[77,0,77,10],[78,0,78,10]]}
["Итоги групповой диагностики   обучающихся (воспитанников) ОУ______________ _________"]
[null,21,22,23,24,25,26,27,28,29,30]
["Фамилия, имя ребенка"]
["Дата рождения"]
["I. Зрительно-моторная координация"]
["узор №1"]
["графомоторные навыки"]
["установление закономерностей"]
["узор №2"]
["графомоторные навыки"]
["установление закономерностей"]
["узор №3"]
["графомоторные навыки"]
["установление закономерностей"]
["самоконтроль "]
["II. Математические представления"]
["Счет"]
["Сравнение"]
["Приведение к равенству"]
["III. Мыслительные процессы"]
["Классификация"]
["Исключение лишнего"]
["IV. Звукобуквенный анализ, синтез, фонематическое восприятие"]
["Звукобуквенный анализ"]
["Фонематическое восприятие"]
["Звуковой синтез"]
["V. Саморегуляция и организация деятельности"]
["Саморегуляция"]
["самоконтроль "]
["VI. Внимание"]
["Пробы на внимание"]
[]
[null,{"$f":"B3","v":0},{"$f":"C3","v":0},{"$f":"D3","v":0},{"$f":"E3","v":0},0,0,0,0,0,0]
["I. Зрительно-моторная координация",{"$f":"(B7+B10+B13)/3","v":{"v":0,"d":"0.00"}},{"v":0,"d":"0.00"},{"v":0,"d":"0.00"},{"v":0,"d":"0.00"},{"v":0,"d":"0.00"},{"v":0,"d":"0.00"},{"v":0,"d":"0.00"},{"v":0,"d":"0.00"},{"v":0,"d":"0.00"},{"v":0,"d":"0.00"}]
["II. Математические представления",{"$f":"(B17+B18+B19)/3","v":{"v":0,"d":"0.00"}},{"$f":"(C17+C18+C19)/3","v":{"v":0,"d":"0.00"}},{"v":0,"d":"0.00"},{"v":0,"d":"0.00"},{"v":0,"d":"0.00"},{"v":0,"d":"0.00"},{"v":0,"d":"0.00"},{"v":0,"d":"0.00"},{"v":0,"d":"0.00"},{"v":0,"d":"0.00"}]
["III. Мыслительные процессы",{"$f":"(B8+B11+B14+B21+B22)/5","v":{"v":0,"d":"0.00"}},{"v":0,"d":"0.00"},{"v":0,"d":"0.00"},{"v":0,"d":"0.00"},{"v":0,"d":"0.00"},{"v":0,"d":"0.00"},{"v":0,"d":"0.00"},{"v":0,"d":"0.00"},{"v":0,"d":"0.00"},{"v":0,"d":"0.00"}]
["IV. Звукобуквенный анализ, синтез, фонематическое восприятие",{"$f":"(B24+B25+B26)/3","v":{"v":0,"d":"0.00"}},{"$f":"(C24+C25+C26)/3","v":{"v":0,"d":"0.00"}},{"$f":"(D24+D25+D26)/3","v":{"v":0,"d":"0.00"}},{"v":0,"d":"0.00"},{"v":0,"d":"0.00"},{"v":0,"d":"0.00"},{"v":0,"d":"0.00"},{"v":0,"d":"0.00"},{"v":0,"d":"0.00"},{"v":0,"d":"0.00"}]
["V. Саморегуляция и организация деятельности",{"$f":"(B15+B28+B29)/3","v":{"v":0,"d":"0.00"}},{"$f":"(C15+C28+C29)/3","v":{"v":0,"d":"0.00"}},{"v":0,"d":"0.00"},{"v":0,"d":"0.00"},{"v":0,"d":"0.00"},{"v":0,"d":"0.00"},{"v":0,"d":"0.00"},{"v":0,"d":"0.00"},{"v":0,"d":"0.00"},{"v":0,"d":"0.00"}]
["VI. Внимание",{"$f":"B31","v":{"v":0,"d":"0.00"}},{"$f":"C31","v":{"v":0,"d":"0.00"}},{"v":0,"d":"0.00"},{"v":0,"d":"0.00"},{"v":0,"d":"0.00"},{"v":0,"d":"0.00"},{"v":0,"d":"0.00"},{"v":0,"d":"0.00"},{"v":0,"d":"0.00"},{"v":0,"d":"0.00"}]
["ИТОГО",{"$f":"(B34+B35+B36+B37+B38+B39)/6","v":{"v":0,"d":"0.00"}},{"v":0,"d":"0.00"},{"v":0,"d":"0.00"},{"v":0,"d":"0.00"},{"v":0,"d":"0.00"},{"v":0,"d":"0.00"},{"v":0,"d":"0.00"},{"v":0,"d":"0.00"},{"v":0,"d":"0.00"},{"v":0,"d":"0.00"}]
[null,{"$f":"IF(B40>3.19,\"IV уровень\",IF(AND(B40<=3.19,B40>=2.5),\"III уровень\",IF(AND(B40<2.5,B40>=2),\"II уровень\",IF(AND(B40<1.99),\"I уровень\"))))","v":"I уровень"},"I уровень","I уровень","I уровень","I уровень","I уровень","I уровень","I уровень","I уровень","I уровень"]
[]
[]
["4 уровень - высокие показатели состояния ВПФ и процессов (средний балл от 3,2 до 4,0) - ребенок не нуждается в проведении специальных коррекционных мероприятий."]
["3 уровень - показатели   средние (средний балл от 2,5 до 3,19) - ребенок не нуждается в проведении специальных коррекционных мероприятий, однако педагогом могут быть даны рекомендации по развивающей работе."]
["2 уровень -   показатели ниже средних (средний балл от 2,0 до 2,49) - ребенок нуждается в проведении специальных коррекционных мероприятий в виде групповых  и индивидуальных занятий."]
[" 1 уровень - низкие показатели(средний балл менее 2) - ребенок нуждается в проведении специальных коррекционных мероприятий в виде индивидуальных занятий."]
[]
[{"$f":"A1","v":"Итоги групповой диагностики   обучающихся (воспитанников) ОУ______________ _________"}]
[null,{"$f":"B2","v":21},22,23,24,25,26,27,28,29,30]
["Фамилия, имя ребенка",{"$f":"B3","v":0},{"$f":"C3","v":0},0,0,0,0,0,0,0,0]
["Дата рождения",{"$f":"B4","v":"00:00:00"},{"$f":"C4","v":"00:00:00"},"00:00:00","00:00:00","00:00:00","00:00:00","00:00:00","00:00:00","00:00:00","00:00:00"]
["сформированность регуляторного компонента деятельности "]
["Задание 1",{"$f":"B31","v":{"v":0,"d":"0.00"}},{"$f":"C31","v":{"v":0,"d":"0.00"}},{"$f":"D31","v":{"v":0,"d":"0.00"}},{"v":0,"d":"0.00"},{"v":0,"d":"0.00"},{"v":0,"d":"0.00"},{"v":0,"d":"0.00"},{"v":0,"d":"0.00"},{"v":0,"d":"0.00"},{"v":0,"d":"0.00"}]
["Задание 3",{"$f":"(B28+B29)/2","v":{"v":0,"d":"0.00"}},{"$f":"(C28+C29)/2","v":{"v":0,"d":"0.00"}},{"$f":"(D28+D29)/2","v":{"v":0,"d":"0.00"}},{"v":0,"d":"0.00"},{"v":0,"d":"0.00"},{"v":0,"d":"0.00"},{"v":0,"d":"0.00"},{"v":0,"d":"0.00"},{"v":0,"d":"0.00"},{"v":0,"d":"0.00"}]
["Задание 4",{"$f":"B15","v":{"v":0,"d":"0.00"}},{"$f":"C15","v":{"v":0,"d":"0.00"}},{"$f":"D15","v":{"v":0,"d":"0.00"}},{"v":0,"d":"0.00"},{"v":0,"d":"0.00"},{"v":0,"d":"0.00"},{"v":0,"d":"0.00"},{"v":0,"d":"0.00"},{"v":0,"d":"0.00"},{"v":0,"d":"0.00"}]
["Задание 5",{"$f":"B19","v":{"v":0,"d":"0.00"}},{"$f":"C19","v":{"v":0,"d":"0.00"}},{"$f":"D19","v":{"v":0,"d":"0.00"}},{"v":0,"d":"0.00"},{"v":0,"d":"0.00"},{"v":0,"d":"0.00"},{"v":0,"d":"0.00"},{"v":0,"d":"0.00"},{"v":0,"d":"0.00"},{"v":0,"d":"0.00"}]
["сформированность предпосылок к учебной деятельности"]
["Задание 2",{"$f":"B26","v":{"v":0,"d":"0.00"}},{"$f":"C26","v":{"v":0,"d":"0.00"}},{"$f":"D26","v":{"v":0,"d":"0.00"}},{"v":0,"d":"0.00"},{"v":0,"d":"0.00"},{"v":0,"d":"0.00"},{"v":0,"d":"0.00"},{"v":0,"d":"0.00"},{"v":0,"d":"0.00"},{"v":0,"d":"0.00"}]
["Задание 5",{"$f":"B35","v":{"v":0,"d":"0.00"}},{"$f":"C35","v":{"v":0,"d":"0.00"}},{"$f":"D35","v":{"v":0,"d":"0.00"}},{"v":0,"d":"0.00"},{"v":0,"d":"0.00"},{"v":0,"d":"0.00"},{"v":0,"d":"0.00"},{"v":0,"d":"0.00"},{"v":0,"d":"0.00"},{"v":0,"d":"0.00"}]
["Задание 8",{"$f":"B24","v":{"v":0,"d":"0.00"}},{"$f":"C24","v":{"v":0,"d":"0.00"}},{"$f":"D24","v":{"v":0,"d":"0.00"}},{"v":0,"d":"0.00"},{"v":0,"d":"0.00"},{"v":0,"d":"0.00"},{"v":0,"d":"0.00"},{"v":0,"d":"0.00"},{"v":0,"d":"0.00"},{"v":0,"d":"0.00"}]
["Задание 9",{"$f":"B25","v":{"v":0,"d":"0.00"}},{"$f":"C25","v":{"v":0,"d":"0.00"}},{"v":0,"d":"0.00"},{"v":0,"d":"0.00"},{"v":0,"d":"0.00"},{"v":0,"d":"0.00"},{"v":0,"d":"0.00"},{"v":0,"d":"0.00"},{"v":0,"d":"0.00"},{"v":0,"d":"0.00"}]
["сформированности пространственных представлений"]
["Задание 4",{"$f":"(B7+B10+B13)/3","v":{"v":0,"d":"0.00"}},{"$f":"(C7+C10+C13)/3","v":{"v":0,"d":"0.00"}},{"$f":"(D7+D10+D13)/3","v":{"v":0,"d":"0.00"}},{"v":0,"d":"0.00"},{"v":0,"d":"0.00"},{"v":0,"d":"0.00"},{"v":0,"d":"0.00"},{"v":0,"d":"0.00"},{"v":0,"d":"0.00"},{"v":0,"d":"0.00"}]
["особенности мыслительной деятельности "]
["Задание 4 (закономерности)",{"$f":"(B8+B11+B14)/3","v":{"v":0,"d":"0.00"}},{"$f":"(C8+C11+C14)/3","v":{"v":0,"d":"0.00"}},{"$f":"(D8+D11+D14)/3","v":{"v":0,"d":"0.00"}},{"v":0,"d":"0.00"},{"v":0,"d":"0.00"},{"v":0,"d":"0.00"},{"v":0,"d":"0.00"},{"v":0,"d":"0.00"},{"v":0,"d":"0.00"},{"v":0,"d":"0.00"}]
["Задание 6",{"$f":"B21","v":{"v":0,"d":"0.00"}},{"$f":"C21","v":{"v":0,"d":"0.00"}},{"$f":"D21","v":{"v":0,"d":"0.00"}},{"v":0,"d":"0.00"},{"v":0,"d":"0.00"},{"v":0,"d":"0.00"},{"v":0,"d":"0.00"},{"v":0,"d":"0.00"},{"v":0,"d":"0.00"},{"v":0,"d":"0.00"}]
["Задание 7",{"$f":"B22","v":{"v":0,"d":"0.00"}},{"$f":"C22","v":{"v":0,"d":"0.00"}},{"v":0,"d":"0.00"},{"v":0,"d":"0.00"},{"v":0,"d":"0.00"},{"v":0,"d":"0.00"},{"v":0,"d":"0.00"},{"v":0,"d":"0.00"},{"v":0,"d":"0.00"},{"v":0,"d":"0.00"}]
[]
["сформированность регуляторного компонента деятельности ",{"$f":"(B54+B28+B29+B56+B57)/5","v":{"v":0,"d":"0.00"}},{"$f":"(C54+C28+C29+C56+C57)/5","v":{"v":0,"d":"0.00"}},{"$f":"(D54+D28+D29+D56+D57)/5","v":{"v":0,"d":"0.00"}},{"v":0,"d":"0.00"},{"v":0,"d":"0.00"},{"v":0,"d":"0.00"},{"v":0,"d":"0.00"},{"v":0,"d":"0.00"},{"v":0,"d":"0.00"},{"v":0,"d":"0.00"}]
["сформированность предпосылок к учебной деятельности",{"$f":"(B59+B17+B18+B19+B61+B62)/6","v":{"v":0,"d":"0.00"}},{"$f":"(C59+C17+C18+C19+C61+C62)/6","v":{"v":0,"d":"0.00"}},{"$f":"(D59+D17+D18+D19+D61+D62)/6","v":{"v":0,"d":"0.00"}},{"v":0,"d":"0.00"},{"v":0,"d":"0.00"},{"v":0,"d":"0.00"},{"v":0,"d":"0.00"},{"v":0,"d":"0.00"},{"v":0,"d":"0.00"},{"v":0,"d":"0.00"}]
["сформированности пространственных представлений",{"$f":"B64","v":{"v":0,"d":"0.00"}},{"$f":"C64","v":{"v":0,"d":"0.00"}},{"$f":"D64","v":{"v":0,"d":"0.00"}},{"v":0,"d":"0.00"},{"v":0,"d":"0.00"},{"v":0,"d":"0.00"},{"v":0,"d":"0.00"},{"v":0,"d":"0.00"},{"v":0,"d":"0.00"},{"v":0,"d":"0.00"}]
["особенности мыслительной деятельности ",{"$f":"(B8+B11+B14+B21+B22)/5","v":{"v":0,"d":"0.00"}},{"$f":"(C8+C11+C14+C21+C22)/5","v":{"v":0,"d":"0.00"}},{"$f":"(D8+D11+D14+D21+D22)/5","v":{"v":0,"d":"0.00"}},{"v":0,"d":"0.00"},{"v":0,"d":"0.00"},{"v":0,"d":"0.00"},{"v":0,"d":"0.00"},{"v":0,"d":"0.00"},{"v":0,"d":"0.00"},{"v":0,"d":"0.00"}]
[null,{"$f":"(B70+B71+B72+B73)/4","v":{"v":0,"d":"0.00"}},{"$f":"(C70+C71+C72+C73)/4","v":{"v":0,"d":"0.00"}},{"$f":"(D70+D71+D72+D73)/4","v":{"v":0,"d":"0.00"}},{"v":0,"d":"0.00"},{"v":0,"d":"0.00"},{"v":0,"d":"0.00"},{"v":0,"d":"0.00"},{"v":0,"d":"0.00"},{"v":0,"d":"0.00"},{"v":0,"d":"0.00"}]
[null,{"$f":"IF(B74>3.19,\"готов\",IF(AND(B74<=3.19,B74>=2.5),\"готов\",IF(AND(B74<2.5,B74>=2),\"частично готов\",IF(AND(B74<2),\"не готов\"))))","v":"не готов"},{"$f":"IF(C74>3.19,\"готов\",IF(AND(C74<=3.19,C74>=2.5),\"готов\",IF(AND(C74<2.5,C74>=2),\"частично готов\",IF(AND(C74<2),\"не готов\"))))","v":"не готов"},"не готов","не готов","не готов","не готов","не готов","не готов","не готов","не готов"]
["4 уровень - высокие показатели готовности(средний балл от 3,2 до 4,0)"]
["3 уровень - показатели   готовности средние (средний балл от 2,50 до 3,19) "]
["2 уровень -   показатели готовности ниже средних (средний балл от 2,0 до 2,49)"]
[" 1 уровень - низкие показатели готовности (средний балл менее 2) "]

{"sheet":"Лист4","index":3,"n_rows":79,"n_cols":11,"rows_kept":79,"merged":[[0,0,0,10],[43,0,43,10],[44,0,44,10],[45,0,45,10],[46,0,46,10],[48,0,48,10],[75,0,75,10],[76,0,76,10],[77,0,77,10],[78,0,78,10]]}
["Итоги групповой диагностики   обучающихся (воспитанников) ОУ______________ _________"]
[null,31,32,33,34,35,36,37,38,39,40]
["Фамилия, имя ребенка"]
["Дата рождения"]
["I. Зрительно-моторная координация"]
["узор №1"]
["графомоторные навыки"]
["установление закономерностей"]
["узор №2"]
["графомоторные навыки"]
["установление закономерностей"]
["узор №3"]
["графомоторные навыки"]
["установление закономерностей"]
["самоконтроль "]
["II. Математические представления"]
["Счет"]
["Сравнение"]
["Приведение к равенству"]
["III. Мыслительные процессы"]
["Классификация"]
["Исключение лишнего"]
["IV. Звукобуквенный анализ, синтез, фонематическое восприятие"]
["Звукобуквенный анализ"]
["Фонематическое восприятие"]
["Звуковой синтез"]
["V. Саморегуляция и организация деятельности"]
["Саморегуляция"]
["самоконтроль "]
["VI. Внимание"]
["Пробы на внимание"]
[]
[null,{"$f":"B3","v":0},{"$f":"C3","v":0},{"$f":"D3","v":0},{"$f":"E3","v":0},0,0,0,0,0,0]
["I. Зрительно-моторная координация",{"$f":"(B7+B10+B13)/3","v":{"v":0,"d":"0.00"}},{"v":0,"d":"0.00"},{"v":0,"d":"0.00"},{"v":0,"d":"0.00"},{"v":0,"d":"0.00"},{"v":0,"d":"0.00"},{"v":0,"d":"0.00"},{"v":0,"d":"0.00"},{"v":0,"d":"0.00"},{"v":0,"d":"0.00"}]
["II. Математические представления",{"$f":"(B17+B18+B19)/3","v":{"v":0,"d":"0.00"}},{"$f":"(C17+C18+C19)/3","v":{"v":0,"d":"0.00"}},{"v":0,"d":"0.00"},{"v":0,"d":"0.00"},{"v":0,"d":"0.00"},{"v":0,"d":"0.00"},{"v":0,"d":"0.00"},{"v":0,"d":"0.00"},{"v":0,"d":"0.00"},{"v":0,"d":"0.00"}]
["III. Мыслительные процессы",{"$f":"(B8+B11+B14+B21+B22)/5","v":{"v":0,"d":"0.00"}},{"v":0,"d":"0.00"},{"v":0,"d":"0.00"},{"v":0,"d":"0.00"},{"v":0,"d":"0.00"},{"v":0,"d":"0.00"},{"v":0,"d":"0.00"},{"v":0,"d":"0.00"},{"v":0,"d":"0.00"},{"v":0,"d":"0.00"}]
["IV. Звукобуквенный анализ, синтез, фонематическое восприятие",{"$f":"(B24+B25+B26)/3","v":{"v":0,"d":"0.00"}},{"$f":"(C24+C25+C26)/3","v":{"v":0,"d":"0.00"}},{"$f":"(D24+D25+D26)/3","v":{"v":0,"d":"0.00"}},{"v":0,"d":"0.00"},{"v":0,"d":"0.00"},{"v":0,"d":"0.00"},{"v":0,"d":"0.00"},{"v":0,"d":"0.00"},{"v":0,"d":"0.00"},{"v":0,"d":"0.00"}]
["V. Саморегуляция и организация деятельности",{"$f":"(B15+B28+B29)/3","v":{"v":0,"d":"0.00"}},{"$f":"(C15+C28+C29)/3","v":{"v":0,"d":"0.00"}},{"v":0,"d":"0.00"},{"v":0,"d":"0.00"},{"v":0,"d":"0.00"},{"v":0,"d":"0.00"},{"v":0,"d":"0.00"},{"v":0,"d":"0.00"},{"v":0,"d":"0.00"},{"v":0,"d":"0.00"}]
["VI. Внимание",{"$f":"B31","v":{"v":0,"d":"0.00"}},{"$f":"C31","v":{"v":0,"d":"0.00"}},{"v":0,"d":"0.00"},{"v":0,"d":"0.00"},{"v":0,"d":"0.00"},{"v":0,"d":"0.00"},{"v":0,"d":"0.00"},{"v":0,"d":"0.00"},{"v":0,"d":"0.00"},{"v":0,"d":"0.00"}]
["ИТОГО",{"$f":"(B34+B35+B36+B37+B38+B39)/6","v":{"v":0,"d":"0.00"}},{"v":0,"d":"0.00"},{"v":0,"d":"0.00"},{"v":0,"d":"0.00"},{"v":0,"d":"0.00"},{"v":0,"d":"0.00"},{"v":0,"d":"0.00"},{"v":0,"d":"0.00"},{"v":0,"d":"0.00"},{"v":0,"d":"0.00"}]
[null,{"$f":"IF(B40>3.19,\"IV уровень\",IF(AND(B40<=3.19,B40>=2.5),\"III уровень\",IF(AND(B40<2.5,B40>=2),\"II уровень\",IF(AND(B40<1.99),\"I уровень\"))))","v":"I уровень"},"I уровень","I уровень","I уровень","I уровень","I уровень","I уровень","I уровень","I уровень","I уровень"]
[]
[]
["4 уровень - высокие показатели состояния ВПФ и процессов (средний балл от 3,2 до 4,0) - ребенок не нуждается в проведении специальных коррекционных мероприятий."]
["3 уровень - показатели   средние (средний балл от 2,5 до 3,19) - ребенок не нуждается в проведении специальных коррекционных мероприятий, однако педагогом могут быть даны рекомендации по развивающей работе."]
["2 уровень -   показатели ниже средних (средний балл от 2,0 до 2,49) - ребенок нуждается в проведении специальных коррекционных мероприятий в виде групповых  и индивидуальных занятий."]
[" 1 уровень - низкие показатели(средний балл менее 2) - ребенок нуждается в проведении специальных коррекционных мероприятий в виде индивидуальных занятий."]
[]
[{"$f":"A1","v":"Итоги групповой диагностики   обучающихся (воспитанников) ОУ______________ _________"}]
[null,{"$f":"B2","v":31},32,33,34,35,36,37,38,39,40]
["Фамилия, имя ребенка",{"$f":"B3","v":0},{"$f":"C3","v":0},0,0,0,0,0,0,0,0]
["Дата рождения",{"$f":"B4","v":"00:00:00"},{"$f":"C4","v":"00:00:00"},"00:00:00","00:00:00","00:00:00","00:00:00","00:00:00","00:00:00","00:00:00","00:00:00"]
["сформированность регуляторного компонента деятельности "]
["Задание 1",{"$f":"B31","v":{"v":0,"d":"0.00"}},{"$f":"C31","v":{"v":0,"d":"0.00"}},{"$f":"D31","v":{"v":0,"d":"0.00"}},{"v":0,"d":"0.00"},{"v":0,"d":"0.00"},{"v":0,"d":"0.00"},{"v":0,"d":"0.00"},{"v":0,"d":"0.00"},{"v":0,"d":"0.00"},{"v":0,"d":"0.00"}]
["Задание 3",{"$f":"(B28+B29)/2","v":{"v":0,"d":"0.00"}},{"$f":"(C28+C29)/2","v":{"v":0,"d":"0.00"}},{"$f":"(D28+D29)/2","v":{"v":0,"d":"0.00"}},{"v":0,"d":"0.00"},{"v":0,"d":"0.00"},{"v":0,"d":"0.00"},{"v":0,"d":"0.00"},{"v":0,"d":"0.00"},{"v":0,"d":"0.00"},{"v":0,"d":"0.00"}]
["Задание 4",{"$f":"B15","v":{"v":0,"d":"0.00"}},{"$f":"C15","v":{"v":0,"d":"0.00"}},{"$f":"D15","v":{"v":0,"d":"0.00"}},{"v":0,"d":"0.00"},{"v":0,"d":"0.00"},{"v":0,"d":"0.00"},{"v":0,"d":"0.00"},{"v":0,"d":"0.00"},{"v":0,"d":"0.00"},{"v":0,"d":"0.00"}]
["Задание 5",{"$f":"B19","v":{"v":0,"d":"0.00"}},{"$f":"C19","v":{"v":0,"d":"0.00"}},{"$f":"D19","v":{"v":0,"d":"0.00"}},{"v":0,"d":"0.00"},{"v":0,"d":"0.00"},{"v":0,"d":"0.00"},{"v":0,"d":"0.00"},{"v":0,"d":"0.00"},{"v":0,"d":"0.00"},{"v":0,"d":"0.00"}]
["сформированность предпосылок к учебной деятельности"]
["Задание 2",{"$f":"B26","v":{"v":0,"d":"0.00"}},{"$f":"C26","v":{"v":0,"d":"0.00"}},{"$f":"D26","v":{"v":0,"d":"0.00"}},{"v":0,"d":"0.00"},{"v":0,"d":"0.00"},{"v":0,"d":"0.00"},{"v":0,"d":"0.00"},{"v":0,"d":"0.00"},{"v":0,"d":"0.00"},{"v":0,"d":"0.00"}]
["Задание 5",{"$f":"B35","v":{"v":0,"d":"0.00"}},{"$f":"C35","v":{"v":0,"d":"0.00"}},{"$f":"D35","v":{"v":0,"d":"0.00"}},{"v":0,"d":"0.00"},{"v":0,"d":"0.00"},{"v":0,"d":"0.00"},{"v":0,"d":"0.00"},{"v":0,"d":"0.00"},{"v":0,"d":"0.00"},{"v":0,"d":"0.00"}]
["Задание 8",{"$f":"B24","v":{"v":0,"d":"0.00"}},{"$f":"C24","v":{"v":0,"d":"0.00"}},{"$f":"D24","v":{"v":0,"d":"0.00"}},{"v":0,"d":"0.00"},{"v":0,"d":"0.00"},{"v":0,"d":"0.00"},{"v":0,"d":"0.00"},{"v":0,"d":"0.00"},{"v":0,"d":"0.00"},{"v":0,"d":"0.00"}]
["Задание 9",{"$f":"B25","v":{"v":0,"d":"0.00"}},{"$f":"C25","v":{"v":0,"d":"0.00"}},{"v":0,"d":"0.00"},{"v":0,"d":"0.00"},{"v":0,"d":"0.00"},{"v":0,"d":"0.00"},{"v":0,"d":"0.00"},{"v":0,"d":"0.00"},{"v":0,"d":"0.00"},{"v":0,"d":"0.00"}]
["сформированности пространственных представлений"]
["Задание 4",{"$f":"(B7+B10+B13)/3","v":{"v":0,"d":"0.00"}},{"$f":"(C7+C10+C13)/3","v":{"v":0,"d":"0.00"}},{"$f":"(D7+D10+D13)/3","v":{"v":0,"d":"0.00"}},{"v":0,"d":"0.00"},{"v":0,"d":"0.00"},{"v":0,"d":"0.00"},{"v":0,"d":"0.00"},{"v":0,"d":"0.00"},{"v":0,"d":"0.00"},{"v":0,"d":"0.00"}]
["особенности мыслительной деятельности "]
["Задание 4 (закономерности)",{"$f":"(B8+B11+B14)/3","v":{"v":0,"d":"0.00"}},{"$f":"(C8+C11+C14)/3","v":{"v":0,"d":"0.00"}},{"$f":"(D8+D11+D14)/3","v":{"v":0,"d":"0.00"}},{"v":0,"d":"0.00"},{"v":0,"d":"0.00"},{"v":0,"d":"0.00"},{"v":0,"d":"0.00"},{"v":0,"d":"0.00"},{"v":0,"d":"0.00"},{"v":0,"d":"0.00"}]
["Задание 6",{"$f":"B21","v":{"v":0,"d":"0.00"}},{"$f":"C21","v":{"v":0,"d":"0.00"}},{"$f":"D21","v":{"v":0,"d":"0.00"}},{"v":0,"d":"0.00"},{"v":0,"d":"0.00"},{"v":0,"d":"0.00"},{"v":0,"d":"0.00"},{"v":0,"d":"0.00"},{"v":0,"d":"0.00"},{"v":0,"d":"0.00"}]
["Задание 7",{"$f":"B22","v":{"v":0,"d":"0.00"}},{"$f":"C22","v":{"v":0,"d":"0.00"}},{"v":0,"d":"0.00"},{"v":0,"d":"0.00"},{"v":0,"d":"0.00"},{"v":0,"d":"0.00"},{"v":0,"d":"0.00"},{"v":0,"d":"0.00"},{"v":0,"d":"0.00"},{"v":0,"d":"0.00"}]
[]
["сформированность регуляторного компонента деятельности ",{"$f":"(B54+B28+B29+B56+B57)/5","v":{"v":0,"d":"0.00"}},{"$f":"(C54+C28+C29+C56+C57)/5","v":{"v":0,"d":"0.00"}},{"$f":"(D54+D28+D29+D56+D57)/5","v":{"v":0,"d":"0.00"}},{"v":0,"d":"0.00"},{"v":0,"d":"0.00"},{"v":0,"d":"0.00"},{"v":0,"d":"0.00"},{"v":0,"d":"0.00"},{"v":0,"d":"0.00"},{"v":0,"d":"0.00"}]
["сформированность предпосылок к учебной деятельности",{"$f":"(B59+B17+B18+B19+B61+B62)/6","v":{"v":0,"d":"0.00"}},{"$f":"(C59+C17+C18+C19+C61+C62)/6","v":{"v":0,"d":"0.00"}},{"$f":"(D59+D17+D18+D19+D61+D62)/6","v":{"v":0,"d":"0.00"}},{"v":0,"d":"0.00"},{"v":0,"d":"0.00"},{"v":0,"d":"0.00"},{"v":0,"d":"0.00"},{"v":0,"d":"0.00"},{"v":0,"d":"0.00"},{"v":0,"d":"0.00"}]
["сформированности пространственных представлений",{"$f":"B64","v":{"v":0,"d":"0.00"}},{"$f":"C64","v":{"v":0,"d":"0.00"}},{"$f":"D64","v":{"v":0,"d":"0.00"}},{"v":0,"d":"0.00"},{"v":0,"d":"0.00"},{"v":0,"d":"0.00"},{"v":0,"d":"0.00"},{"v":0,"d":"0.00"},{"v":0,"d":"0.00"},{"v":0,"d":"0.00"}]
["особенности мыслительной деятельности ",{"$f":"(B8+B11+B14+B21+B22)/5","v":{"v":0,"d":"0.00"}},{"$f":"(C8+C11+C14+C21+C22)/5","v":{"v":0,"d":"0.00"}},{"$f":"(D8+D11+D14+D21+D22)/5","v":{"v":0,"d":"0.00"}},{"v":0,"d":"0.00"},{"v":0,"d":"0.00"},{"v":0,"d":"0.00"},{"v":0,"d":"0.00"},{"v":0,"d":"0.00"},{"v":0,"d":"0.00"},{"v":0,"d":"0.00"}]
[null,{"$f":"(B70+B71+B72+B73)/4","v":{"v":0,"d":"0.00"}},{"$f":"(C70+C71+C72+C73)/4","v":{"v":0,"d":"0.00"}},{"$f":"(D70+D71+D72+D73)/4","v":{"v":0,"d":"0.00"}},{"v":0,"d":"0.00"},{"v":0,"d":"0.00"},{"v":0,"d":"0.00"},{"v":0,"d":"0.00"},{"v":0,"d":"0.00"},{"v":0,"d":"0.00"},{"v":0,"d":"0.00"}]
[null,{"$f":"IF(B74>3.19,\"готов\",IF(AND(B74<=3.19,B74>=2.5),\"готов\",IF(AND(B74<2.5,B74>=2),\"частично готов\",IF(AND(B74<2),\"не готов\"))))","v":"не готов"},{"$f":"IF(C74>3.19,\"готов\",IF(AND(C74<=3.19,C74>=2.5),\"готов\",IF(AND(C74<2.5,C74>=2),\"частично готов\",IF(AND(C74<2),\"не готов\"))))","v":"не готов"},"не готов","не готов","не готов","не готов","не готов","не готов","не готов","не готов"]
["4 уровень - высокие показатели готовности(средний балл от 3,2 до 4,0)"]
["3 уровень - показатели   готовности средние (средний балл от 2,50 до 3,19) "]
["2 уровень -   показатели готовности ниже средних (средний балл от 2,0 до 2,49)"]
[" 1 уровень - низкие показатели готовности (средний балл менее 2) "]

{"sheet":"Лист5","index":4,"n_rows":79,"n_cols":11,"rows_kept":79,"merged":[[0,0,0,10],[43,0,43,10],[44,0,44,10],[45,0,45,10],[46,0,46,10],[48,0,48,10],[75,0,75,10],[76,0,76,10],[77,0,77,10],[78,0,78,10]]}
["Итоги групповой диагностики   обучающихся (воспитанников) ОУ______________ _________"]
[null,41,42,43,44,45,46,47,48,49,50]
["Фамилия, имя ребенка"]
["Дата рождения"]
["I. Зрительно-моторная координация"]
["узор №1"]
["графомоторные навыки"]
["установление закономерностей"]
["узор №2"]
["графомоторные навыки"]
["установление закономерностей"]
["узор №3"]
["графомоторные навыки"]
["установление закономерностей"]
["самоконтроль "]
["II. Математические представления"]
["Счет"]
["Сравнение"]
["Приведение к равенству"]
["III. Мыслительные процессы"]
["Классификация"]
["Исключение лишнего"]
["IV. Звукобуквенный анализ, синтез, фонематическое восприятие"]
["Звукобуквенный анализ"]
["Фонематическое восприятие"]
["Звуковой синтез"]
["V. Саморегуляция и организация деятельности"]
["Саморегуляция"]
["самоконтроль "]
["VI. Внимание"]
["Пробы на внимание"]
[]
[null,{"$f":"B3","v":0},{"$f":"C3","v":0},{"$f":"D3","v":0},{"$f":"E3","v":0},0,0,0,0,0,0]
["I. Зрительно-моторная координация",{"$f":"(B7+B10+B13)/3","v":{"v":0,"d":"0.00"}},{"v":0,"d":"0.00"},{"v":0,"d":"0.00"},{"v":0,"d":"0.00"},{"v":0,"d":"0.00"},{"v":0,"d":"0.00"},{"v":0,"d":"0.00"},{"v":0,"d":"0.00"},{"v":0,"d":"0.00"},{"v":0,"d":"0.00"}]
["II. Математические представления",{"$f":"(B17+B18+B19)/3","v":{"v":0,"d":"0.00"}},{"$f":"(C17+C18+C19)/3","v":{"v":0,"d":"0.00"}},{"v":0,"d":"0.00"},{"v":0,"d":"0.00"},{"v":0,"d":"0.00"},{"v":0,"d":"0.00"},{"v":0,"d":"0.00"},{"v":0,"d":"0.00"},{"v":0,"d":"0.00"},{"v":0,"d":"0.00"}]
["III. Мыслительные процессы",{"$f":"(B8+B11+B14+B21+B22)/5","v":{"v":0,"d":"0.00"}},{"v":0,"d":"0.00"},{"v":0,"d":"0.00"},{"v":0,"d":"0.00"},{"v":0,"d":"0.00"},{"v":0,"d":"0.00"},{"v":0,"d":"0.00"},{"v":0,"d":"0.00"},{"v":0,"d":"0.00"},{"v":0,"d":"0.00"}]
["IV. Звукобуквенный анализ, синтез, фонематическое восприятие",{"$f":"(B24+B25+B26)/3","v":{"v":0,"d":"0.00"}},{"$f":"(C24+C25+C26)/3","v":{"v":0,"d":"0.00"}},{"$f":"(D24+D25+D26)/3","v":{"v":0,"d":"0.00"}},{"v":0,"d":"0.00"},{"v":0,"d":"0.00"},{"v":0,"d":"0.00"},{"v":0,"d":"0.00"},{"v":0,"d":"0.00"},{"v":0,"d":"0.00"},{"v":0,"d":"0.00"}]
["V. Саморегуляция и организация деятельности",{"$f":"(B15+B28+B29)/3","v":{"v":0,"d":"0.00"}},{"$f":"(C15+C28+C29)/3","v":{"v":0,"d":"0.00"}},{"v":0,"d":"0.00"},{"v":0,"d":"0.00"},{"v":0,"d":"0.00"},{"v":0,"d":"0.00"},{"v":0,"d":"0.00"},{"v":0,"d":"0.00"},{"v":0,"d":"0.00"},{"v":0,"d":"0.00"}]
["VI. Внимание",{"$f":"B31","v":{"v":0,"d":"0.00"}},{"$f":"C31","v":{"v":0,"d":"0.00"}},{"v":0,"d":"0.00"},{"v":0,"d":"0.00"},{"v":0,"d":"0.00"},{"v":0,"d":"0.00"},{"v":0,"d":"0.00"},{"v":0,"d":"0.00"},{"v":0,"d":"0.00"},{"v":0,"d":"0.00"}]
["ИТОГО",{"$f":"(B34+B35+B36+B37+B38+B39)/6","v":{"v":0,"d":"0.00"}},{"v":0,"d":"0.00"},{"v":0,"d":"0.00"},{"v":0,"d":"0.00"},{"v":0,"d":"0.00"},{"v":0,"d":"0.00"},{"v":0,"d":"0.00"},{"v":0,"d":"0.00"},{"v":0,"d":"0.00"},{"v":0,"d":"0.00"}]
[null,{"$f":"IF(B40>3.19,\"IV уровень\",IF(AND(B40<=3.19,B40>=2.5),\"III уровень\",IF(AND(B40<2.5,B40>=2),\"II уровень\",IF(AND(B40<1.99),\"I уровень\"))))","v":"I уровень"},"I уровень","I уровень","I уровень","I уровень","I уровень","I уровень","I уровень","I уровень","I уровень"]
[]
[]
["4 уровень - высокие показатели состояния ВПФ и процессов (средний балл от 3,2 до 4,0) - ребенок не нуждается в проведении специальных коррекционных мероприятий."]
["3 уровень - показатели   средние (средний балл от 2,5 до 3,19) - ребенок не нуждается в проведении специальных коррекционных мероприятий, однако педагогом могут быть даны рекомендации по развивающей работе."]
["2 уровень -   показатели ниже средних (средний балл от 2,0 до 2,49) - ребенок нуждается в проведении специальных коррекционных мероприятий в виде групповых  и индивидуальных занятий."]
[" 1 уровень - низкие показатели(средний балл менее 2) - ребенок нуждается в проведении специальных коррекционных мероприятий в виде индивидуальных занятий."]
[]
[{"$f":"A1","v":"Итоги групповой диагностики   обучающихся (воспитанников) ОУ______________ _________"}]
[null,{"$f":"B2","v":41},42,43,44,45,46,47,48,49,50]
["Фамилия, имя ребенка",{"$f":"B3","v":0},{"$f":"C3","v":0},0,0,0,0,0,0,0,0]
["Дата рождения",{"$f":"B4","v":"00:00:00"},{"$f":"C4","v":"00:00:00"},"00:00:00","00:00:00","00:00:00","00:00:00","00:00:00","00:00:00","00:00:00","00:00:00"]
["сформированность регуляторного компонента деятельности "]
["Задание 1",{"$f":"B31","v":{"v":0,"d":"0.00"}},{"$f":"C31","v":{"v":0,"d":"0.00"}},{"$f":"D31","v":{"v":0,"d":"0.00"}},{"v":0,"d":"0.00"},{"v":0,"d":"0.00"},{"v":0,"d":"0.00"},{"v":0,"d":"0.00"},{"v":0,"d":"0.00"},{"v":0,"d":"0.00"},{"v":0,"d":"0.00"}]
["Задание 3",{"$f":"(B28+B29)/2","v":{"v":0,"d":"0.00"}},{"$f":"(C28+C29)/2","v":{"v":0,"d":"0.00"}},{"$f":"(D28+D29)/2","v":{"v":0,"d":"0.00"}},{"v":0,"d":"0.00"},{"v":0,"d":"0.00"},{"v":0,"d":"0.00"},{"v":0,"d":"0.00"},{"v":0,"d":"0.00"},{"v":0,"d":"0.00"},{"v":0,"d":"0.00"}]
["Задание 4",{"$f":"B15","v":{"v":0,"d":"0.00"}},{"$f":"C15","v":{"v":0,"d":"0.00"}},{"$f":"D15","v":{"v":0,"d":"0.00"}},{"v":0,"d":"0.00"},{"v":0,"d":"0.00"},{"v":0,"d":"0.00"},{"v":0,"d":"0.00"},{"v":0,"d":"0.00"},{"v":0,"d":"0.00"},{"v":0,"d":"0.00"}]
["Задание 5",{"$f":"B19","v":{"v":0,"d":"0.00"}},{"$f":"C19","v":{"v":0,"d":"0.00"}},{"$f":"D19","v":{"v":0,"d":"0.00"}},{"v":0,"d":"0.00"},{"v":0,"d":"0.00"},{"v":0,"d":"0.00"},{"v":0,"d":"0.00"},{"v":0,"d":"0.00"},{"v":0,"d":"0.00"},{"v":0,"d":"0.00"}]
["сформированность предпосылок к учебной деятельности"]
["Задание 2",{"$f":"B26","v":{"v":0,"d":"0.00"}},{"$f":"C26","v":{"v":0,"d":"0.00"}},{"$f":"D26","v":{"v":0,"d":"0.00"}},{"v":0,"d":"0.00"},{"v":0,"d":"0.00"},{"v":0,"d":"0.00"},{"v":0,"d":"0.00"},{"v":0,"d":"0.00"},{"v":0,"d":"0.00"},{"v":0,"d":"0.00"}]
["Задание 5",{"$f":"B35","v":{"v":0,"d":"0.00"}},{"$f":"C35","v":{"v":0,"d":"0.00"}},{"$f":"D35","v":{"v":0,"d":"0.00"}},{"v":0,"d":"0.00"},{"v":0,"d":"0.00"},{"v":0,"d":"0.00"},{"v":0,"d":"0.00"},{"v":0,"d":"0.00"},{"v":0,"d":"0.00"},{"v":0,"d":"0.00"}]
["Задание 8",{"$f":"B24","v":{"v":0,"d":"0.00"}},{"$f":"C24","v":{"v":0,"d":"0.00"}},{"$f":"D24","v":{"v":0,"d":"0.00"}},{"v":0,"d":"0.00"},{"v":0,"d":"0.00"},{"v":0,"d":"0.00"},{"v":0,"d":"0.00"},{"v":0,"d":"0.00"},{"v":0,"d":"0.00"},{"v":0,"d":"0.00"}]
["Задание 9",{"$f":"B25","v":{"v":0,"d":"0.00"}},{"$f":"C25","v":{"v":0,"d":"0.00"}},{"v":0,"d":"0.00"},{"v":0,"d":"0.00"},{"v":0,"d":"0.00"},{"v":0,"d":"0.00"},{"v":0,"d":"0.00"},{"v":0,"d":"0.00"},{"v":0,"d":"0.00"},{"v":0,"d":"0.00"}]
["сформированности пространственных представлений"]
["Задание 4",{"$f":"(B7+B10+B13)/3","v":{"v":0,"d":"0.00"}},{"$f":"(C7+C10+C13)/3","v":{"v":0,"d":"0.00"}},{"$f":"(D7+D10+D13)/3","v":{"v":0,"d":"0.00"}},{"v":0,"d":"0.00"},{"v":0,"d":"0.00"},{"v":0,"d":"0.00"},{"v":0,"d":"0.00"},{"v":0,"d":"0.00"},{"v":0,"d":"0.00"},{"v":0,"d":"0.00"}]
["особенности мыслительной деятельности "]
["Задание 4 (закономерности)",{"$f":"(B8+B11+B14)/3","v":{"v":0,"d":"0.00"}},{"$f":"(C8+C11+C14)/3","v":{"v":0,"d":"0.00"}},{"$f":"(D8+D11+D14)/3","v":{"v":0,"d":"0.00"}},{"v":0,"d":"0.00"},{"v":0,"d":"0.00"},{"v":0,"d":"0.00"},{"v":0,"d":"0.00"},{"v":0,"d":"0.00"},{"v":0,"d":"0.00"},{"v":0,"d":"0.00"}]
["Задание 6",{"$f":"B21","v":{"v":0,"d":"0.00"}},{"$f":"C21","v":{"v":0,"d":"0.00"}},{"$f":"D21","v":{"v":0,"d":"0.00"}},{"v":0,"d":"0.00"},{"v":0,"d":"0.00"},{"v":0,"d":"0.00"},{"v":0,"d":"0.00"},{"v":0,"d":"0.00"},{"v":0,"d":"0.00"},{"v":0,"d":"0.00"}]
["Задание 7",{"$f":"B22","v":{"v":0,"d":"0.00"}},{"$f":"C22","v":{"v":0,"d":"0.00"}},{"v":0,"d":"0.00"},{"v":0,"d":"0.00"},{"v":0,"d":"0.00"},{"v":0,"d":"0.00"},{"v":0,"d":"0.00"},{"v":0,"d":"0.00"},{"v":0,"d":"0.00"},{"v":0,"d":"0.00"}]
[]
["сформированность регуляторного компонента деятельности ",{"$f":"(B54+B28+B29+B56+B57)/5","v":{"v":0,"d":"0.00"}},{"$f":"(C54+C28+C29+C56+C57)/5","v":{"v":0,"d":"0.00"}},{"$f":"(D54+D28+D29+D56+D57)/5","v":{"v":0,"d":"0.00"}},{"v":0,"d":"0.00"},{"v":0,"d":"0.00"},{"v":0,"d":"0.00"},{"v":0,"d":"0.00"},{"v":0,"d":"0.00"},{"v":0,"d":"0.00"},{"v":0,"d":"0.00"}]
["сформированность предпосылок к учебной деятельности",{"$f":"(B59+B17+B18+B19+B61+B62)/6","v":{"v":0,"d":"0.00"}},{"$f":"(C59+C17+C18+C19+C61+C62)/6","v":{"v":0,"d":"0.00"}},{"$f":"(D59+D17+D18+D19+D61+D62)/6","v":{"v":0,"d":"0.00"}},{"v":0,"d":"0.00"},{"v":0,"d":"0.00"},{"v":0,"d":"0.00"},{"v":0,"d":"0.00"},{"v":0,"d":"0.00"},{"v":0,"d":"0.00"},{"v":0,"d":"0.00"}]
["сформированности пространственных представлений",{"$f":"B64","v":{"v":0,"d":"0.00"}},{"$f":"C64","v":{"v":0,"d":"0.00"}},{"$f":"D64","v":{"v":0,"d":"0.00"}},{"v":0,"d":"0.00"},{"v":0,"d":"0.00"},{"v":0,"d":"0.00"},{"v":0,"d":"0.00"},{"v":0,"d":"0.00"},{"v":0,"d":"0.00"},{"v":0,"d":"0.00"}]
["особенности мыслительной деятельности ",{"$f":"(B8+B11+B14+B21+B22)/5","v":{"v":0,"d":"0.00"}},{"$f":"(C8+C11+C14+C21+C22)/5","v":{"v":0,"d":"0.00"}},{"$f":"(D8+D11+D14+D21+D22)/5","v":{"v":0,"d":"0.00"}},{"v":0,"d":"0.00"},{"v":0,"d":"0.00"},{"v":0,"d":"0.00"},{"v":0,"d":"0.00"},{"v":0,"d":"0.00"},{"v":0,"d":"0.00"},{"v":0,"d":"0.00"}]
[null,{"$f":"(B70+B71+B72+B73)/4","v":{"v":0,"d":"0.00"}},{"$f":"(C70+C71+C72+C73)/4","v":{"v":0,"d":"0.00"}},{"$f":"(D70+D71+D72+D73)/4","v":{"v":0,"d":"0.00"}},{"v":0,"d":"0.00"},{"v":0,"d":"0.00"},{"v":0,"d":"0.00"},{"v":0,"d":"0.00"},{"v":0,"d":"0.00"},{"v":0,"d":"0.00"},{"v":0,"d":"0.00"}]
[null,{"$f":"IF(B74>3.19,\"готов\",IF(AND(B74<=3.19,B74>=2.5),\"готов\",IF(AND(B74<2.5,B74>=2),\"частично готов\",IF(AND(B74<2),\"не готов\"))))","v":"не готов"},{"$f":"IF(C74>3.19,\"готов\",IF(AND(C74<=3.19,C74>=2.5),\"готов\",IF(AND(C74<2.5,C74>=2),\"частично готов\",IF(AND(C74<2),\"не готов\"))))","v":"не готов"},"не готов","не готов","не готов","не готов","не готов","не готов","не готов","не готов"]
["4 уровень - высокие показатели готовности(средний балл от 3,2 до 4,0)"]
["3 уровень - показатели   готовности средние (средний балл от 2,50 до 3,19) "]
["2 уровень -   показатели готовности ниже средних (средний балл от 2,0 до 2,49)"]
[" 1 уровень - низкие показатели готовности (средний балл менее 2) "]

{"sheet":"Лист6","index":5,"n_rows":79,"n_cols":11,"rows_kept":79,"merged":[[0,0,0,10],[43,0,43,10],[44,0,44,10],[45,0,45,10],[46,0,46,10],[48,0,48,10],[75,0,75,10],[76,0,76,10],[77,0,77,10],[78,0,78,10]]}
["Итоги групповой диагностики   обучающихся (воспитанников) ОУ______________ _________"]
[null,61,62,63,64,65,66,67,68,69,70]
["Фамилия, имя ребенка"]
["Дата рождения"]
["I. Зрительно-моторная координация"]
["узор №1"]
["графомоторные навыки"]
["установление закономерностей"]
["узор №2"]
["графомоторные навыки"]
["установление закономерностей"]
["узор №3"]
["графомоторные навыки"]
["установление закономерностей"]
["самоконтроль "]
["II. Математические представления"]
["Счет"]
["Сравнение"]
["Приведение к равенству"]
["III. Мыслительные процессы"]
["Классификация"]
["Исключение лишнего"]
["IV. Звукобуквенный анализ, синтез, фонематическое восприятие"]
["Звукобуквенный анализ"]
["Фонематическое восприятие"]
["Звуковой синтез"]
["V. Саморегуляция и организация деятельности"]
["Саморегуляция"]
["самоконтроль "]
["VI. Внимание"]
["Пробы на внимание"]
[]
[null,{"$f":"B3","v":0},{"$f":"C3","v":0},{"$f":"D3","v":0},{"$f":"E3","v":0},0,0,0,0,0,0]
["I. Зрительно-моторная координация",{"$f":"(B7+B10+B13)/3","v":{"v":0,"d":"0.00"}},{"v":0,"d":"0.00"},{"v":0,"d":"0.00"},{"v":0,"d":"0.00"},{"v":0,"d":"0.00"},{"v":0,"d":"0.00"},{"v":0,"d":"0.00"},{"v":0,"d":"0.00"},{"v":0,"d":"0.00"},{"v":0,"d":"0.00"}]
["II. Математические представления",{"$f":"(B17+B18+B19)/3","v":{"v":0,"d":"0.00"}},{"$f":"(C17+C18+C19)/3","v":{"v":0,"d":"0.00"}},{"v":0,"d":"0.00"},{"v":0,"d":"0.00"},{"v":0,"d":"0.00"},{"v":0,"d":"0.00"},{"v":0,"d":"0.00"},{"v":0,"d":"0.00"},{"v":0,"d":"0.00"},{"v":0,"d":"0.00"}]
["III. Мыслительные процессы",{"$f":"(B8+B11+B14+B21+B22)/5","v":{"v":0,"d":"0.00"}},{"v":0,"d":"0.00"},{"v":0,"d":"0.00"},{"v":0,"d":"0.00"},{"v":0,"d":"0.00"},{"v":0,"d":"0.00"},{"v":0,"d":"0.00"},{"v":0,"d":"0.00"},{"v":0,"d":"0.00"},{"v":0,"d":"0.00"}]
["IV. Звукобуквенный анализ, синтез, фонематическое восприятие",{"$f":"(B24+B25+B26)/3","v":{"v":0,"d":"0.00"}},{"$f":"(C24+C25+C26)/3","v":{"v":0,"d":"0.00"}},{"$f":"(D24+D25+D26)/3","v":{"v":0,"d":"0.00"}},{"v":0,"d":"0.00"},{"v":0,"d":"0.00"},{"v":0,"d":"0.00"},{"v":0,"d":"0.00"},{"v":0,"d":"0.00"},{"v":0,"d":"0.00"},{"v":0,"d":"0.00"}]
["V. Саморегуляция и организация деятельности",{"$f":"(B15+B28+B29)/3","v":{"v":0,"d":"0.00"}},{"$f":"(C15+C28+C29)/3","v":{"v":0,"d":"0.00"}},{"v":0,"d":"0.00"},{"v":0,"d":"0.00"},{"v":0,"d":"0.00"},{"v":0,"d":"0.00"},{"v":0,"d":"0.00"},{"v":0,"d":"0.00"},{"v":0,"d":"0.00"},{"v":0,"d":"0.00"}]
["VI. Внимание",{"$f":"B31","v":{"v":0,"d":"0.00"}},{"$f":"C31","v":{"v":0,"d":"0.00"}},{"v":0,"d":"0.00"},{"v":0,"d":"0.00"},{"v":0,"d":"0.00"},{"v":0,"d":"0.00"},{"v":0,"d":"0.00"},{"v":0,"d":"0.00"},{"v":0,"d":"0.00"},{"v":0,"d":"0.00"}]
["ИТОГО",{"$f":"(B34+B35+B36+B37+B38+B39)/6","v":{"v":0,"d":"0.00"}},{"v":0,"d":"0.00"},{"v":0,"d":"0.00"},{"v":0,"d":"0.00"},{"v":0,"d":"0.00"},{"v":0,"d":"0.00"},{"v":0,"d":"0.00"},{"v":0,"d":"0.00"},{"v":0,"d":"0.00"},{"v":0,"d":"0.00"}]
[null,{"$f":"IF(B40>3.19,\"IV уровень\",IF(AND(B40<=3.19,B40>=2.5),\"III уровень\",IF(AND(B40<2.5,B40>=2),\"II уровень\",IF(AND(B40<1.99),\"I уровень\"))))","v":"I уровень"},{"$f":"IF(C40>3.19,\"IV уровень\",IF(AND(C40<=3.19,C40>=2.5),\"III уровень\",IF(AND(C40<2.5,C40>=2),\"II уровень\",IF(AND(C40<1.99),\"I уровень\"))))","v":"I уровень"},"I уровень","I уровень","I уровень","I уровень","I уровень","I уровень","I уровень","I уровень"]
[]
[]
["4 уровень - высокие показатели состояния ВПФ и процессов (средний балл от 3,2 до 4,0) - ребенок не нуждается в проведении специальных коррекционных мероприятий."]
["3 уровень - показатели   средние (средний балл от 2,5 до 3,19) - ребенок не нуждается в проведении специальных коррекционных мероприятий, однако педагогом могут быть даны рекомендации по развивающей работе."]
["2 уровень -   показатели ниже средних (средний балл от 2,0 до 2,49) - ребенок нуждается в проведении специальных коррекционных мероприятий в виде групповых  и индивидуальных занятий."]
[" 1 уровень - низкие показатели(средний балл менее 2) - ребенок нуждается в проведении специальных коррекционных мероприятий в виде индивидуальных занятий."]
[]
[{"$f":"A1","v":"Итоги групповой диагностики   обучающихся (воспитанников) ОУ______________ _________"}]
[null,{"$f":"B2","v":61},62,63,64,65,66,67,68,69,70]
["Фамилия, имя ребенка",{"$f":"B3","v":0},{"$f":"C3","v":0},0,0,0,0,0,0,0,0]
["Дата рождения",{"$f":"B4","v":"00:00:00"},{"$f":"C4","v":"00:00:00"},"00:00:00","00:00:00","00:00:00","00:00:00","00:00:00","00:00:00","00:00:00","00:00:00"]
["сформированность регуляторного компонента деятельности "]
["Задание 1",{"$f":"B31","v":{"v":0,"d":"0.00"}},{"$f":"C31","v":{"v":0,"d":"0.00"}},{"$f":"D31","v":{"v":0,"d":"0.00"}},{"v":0,"d":"0.00"},{"v":0,"d":"0.00"},{"v":0,"d":"0.00"},{"v":0,"d":"0.00"},{"v":0,"d":"0.00"},{"v":0,"d":"0.00"},{"v":0,"d":"0.00"}]
["Задание 3",{"$f":"(B28+B29)/2","v":{"v":0,"d":"0.00"}},{"$f":"(C28+C29)/2","v":{"v":0,"d":"0.00"}},{"$f":"(D28+D29)/2","v":{"v":0,"d":"0.00"}},{"v":0,"d":"0.00"},{"v":0,"d":"0.00"},{"v":0,"d":"0.00"},{"v":0,"d":"0.00"},{"v":0,"d":"0.00"},{"v":0,"d":"0.00"},{"v":0,"d":"0.00"}]
["Задание 4",{"$f":"B15","v":{"v":0,"d":"0.00"}},{"$f":"C15","v":{"v":0,"d":"0.00"}},{"$f":"D15","v":{"v":0,"d":"0.00"}},{"v":0,"d":"0.00"},{"v":0,"d":"0.00"},{"v":0,"d":"0.00"},{"v":0,"d":"0.00"},{"v":0,"d":"0.00"},{"v":0,"d":"0.00"},{"v":0,"d":"0.00"}]
["Задание 5",{"$f":"B19","v":{"v":0,"d":"0.00"}},{"$f":"C19","v":{"v":0,"d":"0.00"}},{"$f":"D19","v":{"v":0,"d":"0.00"}},{"v":0,"d":"0.00"},{"v":0,"d":"0.00"},{"v":0,"d":"0.00"},{"v":0,"d":"0.00"},{"v":0,"d":"0.00"},{"v":0,"d":"0.00"},{"v":0,"d":"0.00"}]
["сформированность предпосылок к учебной деятельности"]
["Задание 2",{"$f":"B26","v":{"v":0,"d":"0.00"}},{"$f":"C26","v":{"v":0,"d":"0.00"}},{"$f":"D26","v":{"v":0,"d":"0.00"}},{"v":0,"d":"0.00"},{"v":0,"d":"0.00"},{"v":0,"d":"0.00"},{"v":0,"d":"0.00"},{"v":0,"d":"0.00"},{"v":0,"d":"0.00"},{"v":0,"d":"0.00"}]
["Задание 5",{"$f":"B35","v":{"v":0,"d":"0.00"}},{"$f":"C35","v":{"v":0,"d":"0.00"}},{"$f":"D35","v":{"v":0,"d":"0.00"}},{"v":0,"d":"0.00"},{"v":0,"d":"0.00"},{"v":0,"d":"0.00"},{"v":0,"d":"0.00"},{"v":0,"d":"0.00"},{"v":0,"d":"0.00"},{"v":0,"d":"0.00"}]
["Задание 8",{"$f":"B24","v":{"v":0,"d":"0.00"}},{"$f":"C24","v":{"v":0,"d":"0.00"}},{"$f":"D24","v":{"v":0,"d":"0.00"}},{"v":0,"d":"0.00"},{"v":0,"d":"0.00"},{"v":0,"d":"0.00"},{"v":0,"d":"0.00"},{"v":0,"d":"0.00"},{"v":0,"d":"0.00"},{"v":0,"d":"0.00"}]
["Задание 9",{"$f":"B25","v":{"v":0,"d":"0.00"}},{"$f":"C25","v":{"v":0,"d":"0.00"}},{"v":0,"d":"0.00"},{"v":0,"d":"0.00"},{"v":0,"d":"0.00"},{"v":0,"d":"0.00"},{"v":0,"d":"0.00"},{"v":0,"d":"0.00"},{"v":0,"d":"0.00"},{"v":0,"d":"0.00"}]
["сформированности пространственных представлений"]
["Задание 4",{"$f":"(B7+B10+B13)/3","v":{"v":0,"d":"0.00"}},{"$f":"(C7+C10+C13)/3","v":{"v":0,"d":"0.00"}},{"$f":"(D7+D10+D13)/3","v":{"v":0,"d":"0.00"}},{"v":0,"d":"0.00"},{"v":0,"d":"0.00"},{"v":0,"d":"0.00"},{"v":0,"d":"0.00"},{"v":0,"d":"0.00"},{"v":0,"d":"0.00"},{"v":0,"d":"0.00"}]
["особенности мыслительной деятельности "]
["Задание 4 (закономерности)",{"$f":"(B8+B11+B14)/3","v":{"v":0,"d":"0.00"}},{"$f":"(C8+C11+C14)/3","v":{"v":0,"d":"0.00"}},{"$f":"(D8+D11+D14)/3","v":{"v":0,"d":"0.00"}},{"v":0,"d":"0.00"},{"v":0,"d":"0.00"},{"v":0,"d":"0.00"},{"v":0,"d":"0.00"},{"v":0,"d":"0.00"},{"v":0,"d":"0.00"},{"v":0,"d":"0.00"}]
["Задание 6",{"$f":"B21","v":{"v":0,"d":"0.00"}},{"$f":"C21","v":{"v":0,"d":"0.00"}},{"$f":"D21","v":{"v":0,"d":"0.00"}},{"v":0,"d":"0.00"},{"v":0,"d":"0.00"},{"v":0,"d":"0.00"},{"v":0,"d":"0.00"},{"v":0,"d":"0.00"},{"v":0,"d":"0.00"},{"v":0,"d":"0.00"}]
["Задание 7",{"$f":"B22","v":{"v":0,"d":"0.00"}},{"$f":"C22","v":{"v":0,"d":"0.00"}},{"v":0,"d":"0.00"},{"v":0,"d":"0.00"},{"v":0,"d":"0.00"},{"v":0,"d":"0.00"},{"v":0,"d":"0.00"},{"v":0,"d":"0.00"},{"v":0,"d":"0.00"},{"v":0,"d":"0.00"}]
[]
["сформированность регуляторного компонента деятельности ",{"$f":"(B54+B28+B29+B56+B57)/5","v":{"v":0,"d":"0.00"}},{"$f":"(C54+C28+C29+C56+C57)/5","v":{"v":0,"d":"0.00"}},{"$f":"(D54+D28+D29+D56+D57)/5","v":{"v":0,"d":"0.00"}},{"v":0,"d":"0.00"},{"v":0,"d":"0.00"},{"v":0,"d":"0.00"},{"v":0,"d":"0.00"},{"v":0,"d":"0.00"},{"v":0,"d":"0.00"},{"v":0,"d":"0.00"}]
["сформированность предпосылок к учебной деятельности",{"$f":"(B59+B17+B18+B19+B61+B62)/6","v":{"v":0,"d":"0.00"}},{"$f":"(C59+C17+C18+C19+C61+C62)/6","v":{"v":0,"d":"0.00"}},{"$f":"(D59+D17+D18+D19+D61+D62)/6","v":{"v":0,"d":"0.00"}},{"v":0,"d":"0.00"},{"v":0,"d":"0.00"},{"v":0,"d":"0.00"},{"v":0,"d":"0.00"},{"v":0,"d":"0.00"},{"v":0,"d":"0.00"},{"v":0,"d":"0.00"}]
["сформированности пространственных представлений",{"$f":"B64","v":{"v":0,"d":"0.00"}},{"$f":"C64","v":{"v":0,"d":"0.00"}},{"$f":"D64","v":{"v":0,"d":"0.00"}},{"v":0,"d":"0.00"},{"v":0,"d":"0.00"},{"v":0,"d":"0.00"},{"v":0,"d":"0.00"},{"v":0,"d":"0.00"},{"v":0,"d":"0.00"},{"v":0,"d":"0.00"}]
["особенности мыслительной деятельности ",{"$f":"(B8+B11+B14+B21+B22)/5","v":{"v":0,"d":"0.00"}},{"$f":"(C8+C11+C14+C21+C22)/5","v":{"v":0,"d":"0.00"}},{"$f":"(D8+D11+D14+D21+D22)/5","v":{"v":0,"d":"0.00"}},{"v":0,"d":"0.00"},{"v":0,"d":"0.00"},{"v":0,"d":"0.00"},{"v":0,"d":"0.00"},{"v":0,"d":"0.00"},{"v":0,"d":"0.00"},{"v":0,"d":"0.00"}]
[null,{"$f":"(B70+B71+B72+B73)/4","v":{"v":0,"d":"0.00"}},{"$f":"(C70+C71+C72+C73)/4","v":{"v":0,"d":"0.00"}},{"$f":"(D70+D71+D72+D73)/4","v":{"v":0,"d":"0.00"}},{"v":0,"d":"0.00"},{"v":0,"d":"0.00"},{"v":0,"d":"0.00"},{"v":0,"d":"0.00"},{"v":0,"d":"0.00"},{"v":0,"d":"0.00"},{"v":0,"d":"0.00"}]
[null,{"$f":"IF(B74>3.19,\"готов\",IF(AND(B74<=3.19,B74>=2.5),\"готов\",IF(AND(B74<2.5,B74>=2),\"частично готов\",IF(AND(B74<2),\"не готов\"))))","v":"не готов"},{"$f":"IF(C74>3.19,\"готов\",IF(AND(C74<=3.19,C74>=2.5),\"готов\",IF(AND(C74<2.5,C74>=2),\"частично готов\",IF(AND(C74<2),\"не готов\"))))","v":"не готов"},"не готов","не готов","не готов","не готов","не готов","не готов","не готов","не готов"]
["4 уровень - высокие показатели готовности(средний балл от 3,2 до 4,0)"]
["3 уровень - показатели   готовности средние (средний балл от 2,50 до 3,19) "]
["2 уровень -   показатели готовности ниже средних (средний балл от 2,0 до 2,49)"]
[" 1 уровень - низкие показатели готовности (средний балл менее 2) "]

{"sheet":"Лист7","index":6,"n_rows":79,"n_cols":11,"rows_kept":79,"merged":[[0,0,0,10],[43,0,43,10],[44,0,44,10],[45,0,45,10],[46,0,46,10],[48,0,48,10],[75,0,75,10],[76,0,76,10],[77,0,77,10],[78,0,78,10]]}
["Итоги групповой диагностики   обучающихся (воспитанников) ОУ______________ _________"]
[null,71,72,73,74,75,76,77,78,79,80]
["Фамилия, имя ребенка"]
["Дата рождения"]
["I. Зрительно-моторная координация"]
["узор №1"]
["графомоторные навыки"]
["установление закономерностей"]
["узор №2"]
["графомоторные навыки"]
["установление закономерностей"]
["узор №3"]
["графомоторные навыки"]
["установление закономерностей"]
["самоконтроль "]
["II. Математические представления"]
["Счет"]
["Сравнение"]
["Приведение к равенству"]
["III. Мыслительные процессы"]
["Классификация"]
["Исключение лишнего"]
["IV. Звукобуквенный анализ, синтез, фонематическое восприятие"]
["Звукобуквенный анализ"]
["Фонематическое восприятие"]
["Звуковой синтез"]
["V. Саморегуляция и организация деятельности"]
["Саморегуляция"]
["самоконтроль "]
["VI. Внимание"]
["Пробы на внимание"]
[]
[null,{"$f":"B3","v":0},{"$f":"C3","v":0},{"$f":"D3","v":0},{"$f":"E3","v":0},0,0,0,0,0,0]
["I. Зрительно-моторная координация",{"$f":"(B7+B10+B13)/3","v":{"v":0,"d":"0.00"}},{"v":0,"d":"0.00"},{"v":0,"d":"0.00"},{"v":0,"d":"0.00"},{"v":0,"d":"0.00"},{"v":0,"d":"0.00"},{"v":0,"d":"0.00"},{"v":0,"d":"0.00"},{"v":0,"d":"0.00"},{"v":0,"d":"0.00"}]
["II. Математические представления",{"$f":"(B17+B18+B19)/3","v":{"v":0,"d":"0.00"}},{"$f":"(C17+C18+C19)/3","v":{"v":0,"d":"0.00"}},{"v":0,"d":"0.00"},{"v":0,"d":"0.00"},{"v":0,"d":"0.00"},{"v":0,"d":"0.00"},{"v":0,"d":"0.00"},{"v":0,"d":"0.00"},{"v":0,"d":"0.00"},{"v":0,"d":"0.00"}]
["III. Мыслительные процессы",{"$f":"(B8+B11+B14+B21+B22)/5","v":{"v":0,"d":"0.00"}},{"v":0,"d":"0.00"},{"v":0,"d":"0.00"},{"v":0,"d":"0.00"},{"v":0,"d":"0.00"},{"v":0,"d":"0.00"},{"v":0,"d":"0.00"},{"v":0,"d":"0.00"},{"v":0,"d":"0.00"},{"v":0,"d":"0.00"}]
["IV. Звукобуквенный анализ, синтез, фонематическое восприятие",{"$f":"(B24+B25+B26)/3","v":{"v":0,"d":"0.00"}},{"$f":"(C24+C25+C26)/3","v":{"v":0,"d":"0.00"}},{"$f":"(D24+D25+D26)/3","v":{"v":0,"d":"0.00"}},{"v":0,"d":"0.00"},{"v":0,"d":"0.00"},{"v":0,"d":"0.00"},{"v":0,"d":"0.00"},{"v":0,"d":"0.00"},{"v":0,"d":"0.00"},{"v":0,"d":"0.00"}]
["V. Саморегуляция и организация деятельности",{"$f":"(B15+B28+B29)/3","v":{"v":0,"d":"0.00"}},{"$f":"(C15+C28+C29)/3","v":{"v":0,"d":"0.00"}},{"v":0,"d":"0.00"},{"v":0,"d":"0.00"},{"v":0,"d":"0.00"},{"v":0,"d":"0.00"},{"v":0,"d":"0.00"},{"v":0,"d":"0.00"},{"v":0,"d":"0.00"},{"v":0,"d":"0.00"}]
["VI. Внимание",{"$f":"B31","v":{"v":0,"d":"0.00"}},{"$f":"C31","v":{"v":0,"d":"0.00"}},{"v":0,"d":"0.00"},{"v":0,"d":"0.00"},{"v":0,"d":"0.00"},{"v":0,"d":"0.00"},{"v":0,"d":"0.00"},{"v":0,"d":"0.00"},{"v":0,"d":"0.00"},{"v":0,"d":"0.00"}]
["ИТОГО",{"$f":"(B34+B35+B36+B37+B38+B39)/6","v":{"v":0,"d":"0.00"}},{"v":0,"d":"0.00"},{"v":0,"d":"0.00"},{"v":0,"d":"0.00"},{"v":0,"d":"0.00"},{"v":0,"d":"0.00"},{"v":0,"d":"0.00"},{"v":0,"d":"0.00"},{"v":0,"d":"0.00"},{"v":0,"d":"0.00"}]
[null,{"$f":"IF(B40>3.19,\"IV уровень\",IF(AND(B40<=3.19,B40>=2.5),\"III уровень\",IF(AND(B40<2.5,B40>=2),\"II уровень\",IF(AND(B40<1.99),\"I уровень\"))))","v":"I уровень"},{"$f":"IF(C40>3.19,\"IV уровень\",IF(AND(C40<=3.19,C40>=2.5),\"III уровень\",IF(AND(C40<2.5,C40>=2),\"II уровень\",IF(AND(C40<1.99),\"I уровень\"))))","v":"I уровень"},"I уровень","I уровень","I уровень","I уровень","I уровень","I уровень","I уровень","I уровень"]
[]
[]
["4 уровень - высокие показатели состояния ВПФ и процессов (средний балл от 3,2 до 4,0) - ребенок не нуждается в проведении специальных коррекционных мероприятий."]
["3 уровень - показатели   средние (средний балл от 2,5 до 3,19) - ребенок не нуждается в проведении специальных коррекционных мероприятий, однако педагогом могут быть даны рекомендации по развивающей работе."]
["2 уровень -   показатели ниже средних (средний балл от 2,0 до 2,49) - ребенок нуждается в проведении специальных коррекционных мероприятий в виде групповых  и индивидуальных занятий."]
[" 1 уровень - низкие показатели(средний балл менее 2) - ребенок нуждается в проведении специальных коррекционных мероприятий в виде индивидуальных занятий."]
[]
[{"$f":"A1","v":"Итоги групповой диагностики   обучающихся (воспитанников) ОУ______________ _________"}]
[null,{"$f":"B2","v":71},72,73,74,75,76,77,78,79,80]
["Фамилия, имя ребенка",{"$f":"B3","v":0},{"$f":"C3","v":0},0,0,0,0,0,0,0,0]
["Дата рождения",{"$f":"B4","v":"00:00:00"},{"$f":"C4","v":"00:00:00"},"00:00:00","00:00:00","00:00:00","00:00:00","00:00:00","00:00:00","00:00:00","00:00:00"]
["сформированность регуляторного компонента деятельности "]
["Задание 1",{"$f":"B31","v":{"v":0,"d":"0.00"}},{"$f":"C31","v":{"v":0,"d":"0.00"}},{"$f":"D31","v":{"v":0,"d":"0.00"}},{"v":0,"d":"0.00"},{"v":0,"d":"0.00"},{"v":0,"d":"0.00"},{"v":0,"d":"0.00"},{"v":0,"d":"0.00"},{"v":0,"d":"0.00"},{"v":0,"d":"0.00"}]
["Задание 3",{"$f":"(B28+B29)/2","v":{"v":0,"d":"0.00"}},{"$f":"(C28+C29)/2","v":{"v":0,"d":"0.00"}},{"$f":"(D28+D29)/2","v":{"v":0,"d":"0.00"}},{"v":0,"d":"0.00"},{"v":0,"d":"0.00"},{"v":0,"d":"0.00"},{"v":0,"d":"0.00"},{"v":0,"d":"0.00"},{"v":0,"d":"0.00"},{"v":0,"d":"0.00"}]
["Задание 4",{"$f":"B15","v":{"v":0,"d":"0.00"}},{"$f":"C15","v":{"v":0,"d":"0.00"}},{"$f":"D15","v":{"v":0,"d":"0.00"}},{"v":0,"d":"0.00"},{"v":0,"d":"0.00"},{"v":0,"d":"0.00"},{"v":0,"d":"0.00"},{"v":0,"d":"0.00"},{"v":0,"d":"0.00"},{"v":0,"d":"0.00"}]
["Задание 5",{"$f":"B19","v":{"v":0,"d":"0.00"}},{"$f":"C19","v":{"v":0,"d":"0.00"}},{"$f":"D19","v":{"v":0,"d":"0.00"}},{"v":0,"d":"0.00"},{"v":0,"d":"0.00"},{"v":0,"d":"0.00"},{"v":0,"d":"0.00"},{"v":0,"d":"0.00"},{"v":0,"d":"0.00"},{"v":0,"d":"0.00"}]
["сформированность предпосылок к учебной деятельности"]
["Задание 2",{"$f":"B26","v":{"v":0,"d":"0.00"}},{"$f":"C26","v":{"v":0,"d":"0.00"}},{"$f":"D26","v":{"v":0,"d":"0.00"}},{"v":0,"d":"0.00"},{"v":0,"d":"0.00"},{"v":0,"d":"0.00"},{"v":0,"d":"0.00"},{"v":0,"d":"0.00"},{"v":0,"d":"0.00"},{"v":0,"d":"0.00"}]
["Задание 5",{"$f":"B35","v":{"v":0,"d":"0.00"}},{"$f":"C35","v":{"v":0,"d":"0.00"}},{"$f":"D35","v":{"v":0,"d":"0.00"}},{"v":0,"d":"0.00"},{"v":0,"d":"0.00"},{"v":0,"d":"0.00"},{"v":0,"d":"0.00"},{"v":0,"d":"0.00"},{"v":0,"d":"0.00"},{"v":0,"d":"0.00"}]
["Задание 8",{"$f":"B24","v":{"v":0,"d":"0.00"}},{"$f":"C24","v":{"v":0,"d":"0.00"}},{"$f":"D24","v":{"v":0,"d":"0.00"}},{"v":0,"d":"0.00"},{"v":0,"d":"0.00"},{"v":0,"d":"0.00"},{"v":0,"d":"0.00"},{"v":0,"d":"0.00"},{"v":0,"d":"0.00"},{"v":0,"d":"0.00"}]
["Задание 9",{"$f":"B25","v":{"v":0,"d":"0.00"}},{"$f":"C25","v":{"v":0,"d":"0.00"}},{"v":0,"d":"0.00"},{"v":0,"d":"0.00"},{"v":0,"d":"0.00"},{"v":0,"d":"0.00"},{"v":0,"d":"0.00"},{"v":0,"d":"0.00"},{"v":0,"d":"0.00"},{"v":0,"d":"0.00"}]
["сформированности пространственных представлений"]
["Задание 4",{"$f":"(B7+B10+B13)/3","v":{"v":0,"d":"0.00"}},{"$f":"(C7+C10+C13)/3","v":{"v":0,"d":"0.00"}},{"$f":"(D7+D10+D13)/3","v":{"v":0,"d":"0.00"}},{"v":0,"d":"0.00"},{"v":0,"d":"0.00"},{"v":0,"d":"0.00"},{"v":0,"d":"0.00"},{"v":0,"d":"0.00"},{"v":0,"d":"0.00"},{"v":0,"d":"0.00"}]
["особенности мыслительной деятельности "]
["Задание 4 (закономерности)",{"$f":"(B8+B11+B14)/3","v":{"v":0,"d":"0.00"}},{"$f":"(C8+C11+C14)/3","v":{"v":0,"d":"0.00"}},{"$f":"(D8+D11+D14)/3","v":{"v":0,"d":"0.00"}},{"v":0,"d":"0.00"},{"v":0,"d":"0.00"},{"v":0,"d":"0.00"},{"v":0,"d":"0.00"},{"v":0,"d":"0.00"},{"v":0,"d":"0.00"},{"v":0,"d":"0.00"}]
["Задание 6",{"$f":"B21","v":{"v":0,"d":"0.00"}},{"$f":"C21","v":{"v":0,"d":"0.00"}},{"$f":"D21","v":{"v":0,"d":"0.00"}},{"v":0,"d":"0.00"},{"v":0,"d":"0.00"},{"v":0,"d":"0.00"},{"v":0,"d":"0.00"},{"v":0,"d":"0.00"},{"v":0,"d":"0.00"},{"v":0,"d":"0.00"}]
["Задание 7",{"$f":"B22","v":{"v":0,"d":"0.00"}},{"$f":"C22","v":{"v":0,"d":"0.00"}},{"v":0,"d":"0.00"},{"v":0,"d":"0.00"},{"v":0,"d":"0.00"},{"v":0,"d":"0.00"},{"v":0,"d":"0.00"},{"v":0,"d":"0.00"},{"v":0,"d":"0.00"},{"v":0,"d":"0.00"}]
[]
["сформированность регуляторного компонента деятельности ",{"$f":"(B54+B28+B29+B56+B57)/5","v":{"v":0,"d":"0.00"}},{"$f":"(C54+C28+C29+C56+C57)/5","v":{"v":0,"d":"0.00"}},{"$f":"(D54+D28+D29+D56+D57)/5","v":{"v":0,"d":"0.00"}},{"v":0,"d":"0.00"},{"v":0,"d":"0.00"},{"v":0,"d":"0.00"},{"v":0,"d":"0.00"},{"v":0,"d":"0.00"},{"v":0,"d":"0.00"},{"v":0,"d":"0.00"}]
["сформированность предпосылок к учебной деятельности",{"$f":"(B59+B17+B18+B19+B61+B62)/6","v":{"v":0,"d":"0.00"}},{"$f":"(C59+C17+C18+C19+C61+C62)/6","v":{"v":0,"d":"0.00"}},{"$f":"(D59+D17+D18+D19+D61+D62)/6","v":{"v":0,"d":"0.00"}},{"v":0,"d":"0.00"},{"v":0,"d":"0.00"},{"v":0,"d":"0.00"},{"v":0,"d":"0.00"},{"v":0,"d":"0.00"},{"v":0,"d":"0.00"},{"v":0,"d":"0.00"}]
["сформированности пространственных представлений",{"$f":"B64","v":{"v":0,"d":"0.00"}},{"$f":"C64","v":{"v":0,"d":"0.00"}},{"$f":"D64","v":{"v":0,"d":"0.00"}},{"v":0,"d":"0.00"},{"v":0,"d":"0.00"},{"v":0,"d":"0.00"},{"v":0,"d":"0.00"},{"v":0,"d":"0.00"},{"v":0,"d":"0.00"},{"v":0,"d":"0.00"}]
["особенности мыслительной деятельности ",{"$f":"(B8+B11+B14+B21+B22)/5","v":{"v":0,"d":"0.00"}},{"$f":"(C8+C11+C14+C21+C22)/5","v":{"v":0,"d":"0.00"}},{"$f":"(D8+D11+D14+D21+D22)/5","v":{"v":0,"d":"0.00"}},{"v":0,"d":"0.00"},{"v":0,"d":"0.00"},{"v":0,"d":"0.00"},{"v":0,"d":"0.00"},{"v":0,"d":"0.00"},{"v":0,"d":"0.00"},{"v":0,"d":"0.00"}]
[null,{"$f":"(B70+B71+B72+B73)/4","v":{"v":0,"d":"0.00"}},{"$f":"(C70+C71+C72+C73)/4","v":{"v":0,"d":"0.00"}},{"$f":"(D70+D71+D72+D73)/4","v":{"v":0,"d":"0.00"}},{"v":0,"d":"0.00"},{"v":0,"d":"0.00"},{"v":0,"d":"0.00"},{"v":0,"d":"0.00"},{"v":0,"d":"0.00"},{"v":0,"d":"0.00"},{"v":0,"d":"0.00"}]
[null,{"$f":"IF(B74>3.19,\"готов\",IF(AND(B74<=3.19,B74>=2.5),\"готов\",IF(AND(B74<2.5,B74>=2),\"частично готов\",IF(AND(B74<2),\"не готов\"))))","v":"не готов"},{"$f":"IF(C74>3.19,\"готов\",IF(AND(C74<=3.19,C74>=2.5),\"готов\",IF(AND(C74<2.5,C74>=2),\"частично готов\",IF(AND(C74<2),\"не готов\"))))","v":"не готов"},"не готов","не готов","не готов","не готов","не готов","не готов","не готов","не готов"]
["4 уровень - высокие показатели готовности(средний балл от 3,2 до 4,0)"]
["3 уровень - показатели   готовности средние (средний балл от 2,50 до 3,19) "]
["2 уровень -   показатели готовности ниже средних (средний балл от 2,0 до 2,49)"]
[" 1 уровень - низкие показатели готовности (средний балл менее 2) "]

{"sheet":"Лист8","index":7,"n_rows":79,"n_cols":11,"rows_kept":79,"merged":[[0,0,0,10],[43,0,43,10],[44,0,44,10],[45,0,45,10],[46,0,46,10],[48,0,48,10],[75,0,75,10],[76,0,76,10],[77,0,77,10],[78,0,78,10]]}
["Итоги групповой диагностики   обучающихся (воспитанников) ОУ______________ _________"]
[null,81,82,83,84,85,86,87,88,89,90]
["Фамилия, имя ребенка"]
["Дата рождения"]
["I. Зрительно-моторная координация"]
["узор №1"]
["графомоторные навыки"]
["установление закономерностей"]
["узор №2"]
["графомоторные навыки"]
["установление закономерностей"]
["узор №3"]
["графомоторные навыки"]
["установление закономерностей"]
["самоконтроль "]
["II. Математические представления"]
["Счет"]
["Сравнение"]
["Приведение к равенству"]
["III. Мыслительные процессы"]
["Классификация"]
["Исключение лишнего"]
["IV. Звукобуквенный анализ, синтез, фонематическое восприятие"]
["Звукобуквенный анализ"]
["Фонематическое восприятие"]
["Звуковой синтез"]
["V. Саморегуляция и организация деятельности"]
["Саморегуляция"]
["самоконтроль "]
["VI. Внимание"]
["Пробы на внимание"]
[]
[null,{"$f":"B3","v":0},{"$f":"C3","v":0},{"$f":"D3","v":0},{"$f":"E3","v":0},0,0,0,0,0,0]
["I. Зрительно-моторная координация",{"$f":"(B7+B10+B13)/3","v":{"v":0,"d":"0.00"}},{"v":0,"d":"0.00"},{"v":0,"d":"0.00"},{"v":0,"d":"0.00"},{"v":0,"d":"0.00"},{"v":0,"d":"0.00"},{"v":0,"d":"0.00"},{"v":0,"d":"0.00"},{"v":0,"d":"0.00"},{"v":0,"d":"0.00"}]
["II. Математические представления",{"$f":"(B17+B18+B19)/3","v":{"v":0,"d":"0.00"}},{"$f":"(C17+C18+C19)/3","v":{"v":0,"d":"0.00"}},{"v":0,"d":"0.00"},{"v":0,"d":"0.00"},{"v":0,"d":"0.00"},{"v":0,"d":"0.00"},{"v":0,"d":"0.00"},{"v":0,"d":"0.00"},{"v":0,"d":"0.00"},{"v":0,"d":"0.00"}]
["III. Мыслительные процессы",{"$f":"(B8+B11+B14+B21+B22)/5","v":{"v":0,"d":"0.00"}},{"v":0,"d":"0.00"},{"v":0,"d":"0.00"},{"v":0,"d":"0.00"},{"v":0,"d":"0.00"},{"v":0,"d":"0.00"},{"v":0,"d":"0.00"},{"v":0,"d":"0.00"},{"v":0,"d":"0.00"},{"v":0,"d":"0.00"}]
["IV. Звукобуквенный анализ, синтез, фонематическое восприятие",{"$f":"(B24+B25+B26)/3","v":{"v":0,"d":"0.00"}},{"$f":"(C24+C25+C26)/3","v":{"v":0,"d":"0.00"}},{"$f":"(D24+D25+D26)/3","v":{"v":0,"d":"0.00"}},{"v":0,"d":"0.00"},{"v":0,"d":"0.00"},{"v":0,"d":"0.00"},{"v":0,"d":"0.00"},{"v":0,"d":"0.00"},{"v":0,"d":"0.00"},{"v":0,"d":"0.00"}]
["V. Саморегуляция и организация деятельности",{"$f":"(B15+B28+B29)/3","v":{"v":0,"d":"0.00"}},{"$f":"(C15+C28+C29)/3","v":{"v":0,"d":"0.00"}},{"v":0,"d":"0.00"},{"v":0,"d":"0.00"},{"v":0,"d":"0.00"},{"v":0,"d":"0.00"},{"v":0,"d":"0.00"},{"v":0,"d":"0.00"},{"v":0,"d":"0.00"},{"v":0,"d":"0.00"}]
["VI. Внимание",{"$f":"B31","v":{"v":0,"d":"0.00"}},{"$f":"C31","v":{"v":0,"d":"0.00"}},{"v":0,"d":"0.00"},{"v":0,"d":"0.00"},{"v":0,"d":"0.00"},{"v":0,"d":"0.00"},{"v":0,"d":"0.00"},{"v":0,"d":"0.00"},{"v":0,"d":"0.00"},{"v":0,"d":"0.00"}]
["ИТОГО",{"$f":"(B34+B35+B36+B37+B38+B39)/6","v":{"v":0,"d":"0.00"}},{"v":0,"d":"0.00"},{"v":0,"d":"0.00"},{"v":0,"d":"0.00"},{"v":0,"d":"0.00"},{"v":0,"d":"0.00"},{"v":0,"d":"0.00"},{"v":0,"d":"0.00"},{"v":0,"d":"0.00"},{"v":0,"d":"0.00"}]
[null,{"$f":"IF(B40>3.19,\"IV уровень\",IF(AND(B40<=3.19,B40>=2.5),\"III уровень\",IF(AND(B40<2.5,B40>=2),\"II уровень\",IF(AND(B40<1.99),\"I уровень\"))))","v":"I уровень"},{"$f":"IF(C40>3.19,\"IV уровень\",IF(AND(C40<=3.19,C40>=2.5),\"III уровень\",IF(AND(C40<2.5,C40>=2),\"II уровень\",IF(AND(C40<1.99),\"I уровень\"))))","v":"I уровень"},"I уровень","I уровень","I уровень","I уровень","I уровень","I уровень","I уровень","I уровень"]
[]
[]
["4 уровень - высокие показатели состояния ВПФ и процессов (средний балл от 3,2 до 4,0) - ребенок не нуждается в проведении специальных коррекционных мероприятий."]
["3 уровень - показатели   средние (средний балл от 2,5 до 3,19) - ребенок не нуждается в проведении специальных коррекционных мероприятий, однако педагогом могут быть даны рекомендации по развивающей работе."]
["2 уровень -   показатели ниже средних (средний балл от 2,0 до 2,49) - ребенок нуждается в проведении специальных коррекционных мероприятий в виде групповых  и индивидуальных занятий."]
[" 1 уровень - низкие показатели(средний балл менее 2) - ребенок нуждается в проведении специальных коррекционных мероприятий в виде индивидуальных занятий."]
[]
[{"$f":"A1","v":"Итоги групповой диагностики   обучающихся (воспитанников) ОУ______________ _________"}]
[null,{"$f":"B2","v":81},82,83,84,85,86,87,88,89,90]
["Фамилия, имя ребенка",{"$f":"B3","v":0},{"$f":"C3","v":0},0,0,0,0,0,0,0,0]
["Дата рождения",{"$f":"B4","v":"00:00:00"},{"$f":"C4","v":"00:00:00"},"00:00:00","00:00:00","00:00:00","00:00:00","00:00:00","00:00:00","00:00:00","00:00:00"]
["сформированность регуляторного компонента деятельности "]
["Задание 1",{"$f":"B31","v":{"v":0,"d":"0.00"}},{"$f":"C31","v":{"v":0,"d":"0.00"}},{"$f":"D31","v":{"v":0,"d":"0.00"}},{"v":0,"d":"0.00"},{"v":0,"d":"0.00"},{"v":0,"d":"0.00"},{"v":0,"d":"0.00"},{"v":0,"d":"0.00"},{"v":0,"d":"0.00"},{"v":0,"d":"0.00"}]
["Задание 3",{"$f":"(B28+B29)/2","v":{"v":0,"d":"0.00"}},{"$f":"(C28+C29)/2","v":{"v":0,"d":"0.00"}},{"$f":"(D28+D29)/2","v":{"v":0,"d":"0.00"}},{"v":0,"d":"0.00"},{"v":0,"d":"0.00"},{"v":0,"d":"0.00"},{"v":0,"d":"0.00"},{"v":0,"d":"0.00"},{"v":0,"d":"0.00"},{"v":0,"d":"0.00"}]
["Задание 4",{"$f":"B15","v":{"v":0,"d":"0.00"}},{"$f":"C15","v":{"v":0,"d":"0.00"}},{"$f":"D15","v":{"v":0,"d":"0.00"}},{"v":0,"d":"0.00"},{"v":0,"d":"0.00"},{"v":0,"d":"0.00"},{"v":0,"d":"0.00"},{"v":0,"d":"0.00"},{"v":0,"d":"0.00"},{"v":0,"d":"0.00"}]
["Задание 5",{"$f":"B19","v":{"v":0,"d":"0.00"}},{"$f":"C19","v":{"v":0,"d":"0.00"}},{"$f":"D19","v":{"v":0,"d":"0.00"}},{"v":0,"d":"0.00"},{"v":0,"d":"0.00"},{"v":0,"d":"0.00"},{"v":0,"d":"0.00"},{"v":0,"d":"0.00"},{"v":0,"d":"0.00"},{"v":0,"d":"0.00"}]
["сформированность предпосылок к учебной деятельности"]
["Задание 2",{"$f":"B26","v":{"v":0,"d":"0.00"}},{"$f":"C26","v":{"v":0,"d":"0.00"}},{"$f":"D26","v":{"v":0,"d":"0.00"}},{"v":0,"d":"0.00"},{"v":0,"d":"0.00"},{"v":0,"d":"0.00"},{"v":0,"d":"0.00"},{"v":0,"d":"0.00"},{"v":0,"d":"0.00"},{"v":0,"d":"0.00"}]
["Задание 5",{"$f":"B35","v":{"v":0,"d":"0.00"}},{"$f":"C35","v":{"v":0,"d":"0.00"}},{"$f":"D35","v":{"v":0,"d":"0.00"}},{"v":0,"d":"0.00"},{"v":0,"d":"0.00"},{"v":0,"d":"0.00"},{"v":0,"d":"0.00"},{"v":0,"d":"0.00"},{"v":0,"d":"0.00"},{"v":0,"d":"0.00"}]
["Задание 8",{"$f":"B24","v":{"v":0,"d":"0.00"}},{"$f":"C24","v":{"v":0,"d":"0.00"}},{"$f":"D24","v":{"v":0,"d":"0.00"}},{"v":0,"d":"0.00"},{"v":0,"d":"0.00"},{"v":0,"d":"0.00"},{"v":0,"d":"0.00"},{"v":0,"d":"0.00"},{"v":0,"d":"0.00"},{"v":0,"d":"0.00"}]
["Задание 9",{"$f":"B25","v":{"v":0,"d":"0.00"}},{"$f":"C25","v":{"v":0,"d":"0.00"}},{"v":0,"d":"0.00"},{"v":0,"d":"0.00"},{"v":0,"d":"0.00"},{"v":0,"d":"0.00"},{"v":0,"d":"0.00"},{"v":0,"d":"0.00"},{"v":0,"d":"0.00"},{"v":0,"d":"0.00"}]
["сформированности пространственных представлений"]
["Задание 4",{"$f":"(B7+B10+B13)/3","v":{"v":0,"d":"0.00"}},{"$f":"(C7+C10+C13)/3","v":{"v":0,"d":"0.00"}},{"$f":"(D7+D10+D13)/3","v":{"v":0,"d":"0.00"}},{"v":0,"d":"0.00"},{"v":0,"d":"0.00"},{"v":0,"d":"0.00"},{"v":0,"d":"0.00"},{"v":0,"d":"0.00"},{"v":0,"d":"0.00"},{"v":0,"d":"0.00"}]
["особенности мыслительной деятельности "]
["Задание 4 (закономерности)",{"$f":"(B8+B11+B14)/3","v":{"v":0,"d":"0.00"}},{"$f":"(C8+C11+C14)/3","v":{"v":0,"d":"0.00"}},{"$f":"(D8+D11+D14)/3","v":{"v":0,"d":"0.00"}},{"v":0,"d":"0.00"},{"v":0,"d":"0.00"},{"v":0,"d":"0.00"},{"v":0,"d":"0.00"},{"v":0,"d":"0.00"},{"v":0,"d":"0.00"},{"v":0,"d":"0.00"}]
["Задание 6",{"$f":"B21","v":{"v":0,"d":"0.00"}},{"$f":"C21","v":{"v":0,"d":"0.00"}},{"$f":"D21","v":{"v":0,"d":"0.00"}},{"v":0,"d":"0.00"},{"v":0,"d":"0.00"},{"v":0,"d":"0.00"},{"v":0,"d":"0.00"},{"v":0,"d":"0.00"},{"v":0,"d":"0.00"},{"v":0,"d":"0.00"}]
["Задание 7",{"$f":"B22","v":{"v":0,"d":"0.00"}},{"$f":"C22","v":{"v":0,"d":"0.00"}},{"v":0,"d":"0.00"},{"v":0,"d":"0.00"},{"v":0,"d":"0.00"},{"v":0,"d":"0.00"},{"v":0,"d":"0.00"},{"v":0,"d":"0.00"},{"v":0,"d":"0.00"},{"v":0,"d":"0.00"}]
[]
["сформированность регуляторного компонента деятельности ",{"$f":"(B54+B28+B29+B56+B57)/5","v":{"v":0,"d":"0.00"}},{"$f":"(C54+C28+C29+C56+C57)/5","v":{"v":0,"d":"0.00"}},{"$f":"(D54+D28+D29+D56+D57)/5","v":{"v":0,"d":"0.00"}},{"v":0,"d":"0.00"},{"v":0,"d":"0.00"},{"v":0,"d":"0.00"},{"v":0,"d":"0.00"},{"v":0,"d":"0.00"},{"v":0,"d":"0.00"},{"v":0,"d":"0.00"}]
["сформированность предпосылок к учебной деятельности",{"$f":"(B59+B17+B18+B19+B61+B62)/6","v":{"v":0,"d":"0.00"}},{"$f":"(C59+C17+C18+C19+C61+C62)/6","v":{"v":0,"d":"0.00"}},{"$f":"(D59+D17+D18+D19+D61+D62)/6","v":{"v":0,"d":"0.00"}},{"v":0,"d":"0.00"},{"v":0,"d":"0.00"},{"v":0,"d":"0.00"},{"v":0,"d":"0.00"},{"v":0,"d":"0.00"},{"v":0,"d":"0.00"},{"v":0,"d":"0.00"}]
["сформированности пространственных представлений",{"$f":"B64","v":{"v":0,"d":"0.00"}},{"$f":"C64","v":{"v":0,"d":"0.00"}},{"$f":"D64","v":{"v":0,"d":"0.00"}},{"v":0,"d":"0.00"},{"v":0,"d":"0.00"},{"v":0,"d":"0.00"},{"v":0,"d":"0.00"},{"v":0,"d":"0.00"},{"v":0,"d":"0.00"},{"v":0,"d":"0.00"}]
["особенности мыслительной деятельности ",{"$f":"(B8+B11+B14+B21+B22)/5","v":{"v":0,"d":"0.00"}},{"$f":"(C8+C11+C14+C21+C22)/5","v":{"v":0,"d":"0.00"}},{"$f":"(D8+D11+D14+D21+D22)/5","v":{"v":0,"d":"0.00"}},{"v":0,"d":"0.00"},{"v":0,"d":"0.00"},{"v":0,"d":"0.00"},{"v":0,"d":"0.00"},{"v":0,"d":"0.00"},{"v":0,"d":"0.00"},{"v":0,"d":"0.00"}]
[null,{"$f":"(B70+B71+B72+B73)/4","v":{"v":0,"d":"0.00"}},{"$f":"(C70+C71+C72+C73)/4","v":{"v":0,"d":"0.00"}},{"$f":"(D70+D71+D72+D73)/4","v":{"v":0,"d":"0.00"}},{"v":0,"d":"0.00"},{"v":0,"d":"0.00"},{"v":0,"d":"0.00"},{"v":0,"d":"0.00"},{"v":0,"d":"0.00"},{"v":0,"d":"0.00"},{"v":0,"d":"0.00"}]
[null,{"$f":"IF(B74>3.19,\"готов\",IF(AND(B74<=3.19,B74>=2.5),\"готов\",IF(AND(B74<2.5,B74>=2),\"частично готов\",IF(AND(B74<2),\"не готов\"))))","v":"не готов"},{"$f":"IF(C74>3.19,\"готов\",IF(AND(C74<=3.19,C74>=2.5),\"готов\",IF(AND(C74<2.5,C74>=2),\"частично готов\",IF(AND(C74<2),\"не готов\"))))","v":"не готов"},"не готов","не готов","не готов","не готов","не готов","не готов","не готов","не готов"]
["4 уровень - высокие показатели готовности(средний балл от 3,2 до 4,0)"]
["3 уровень - показатели   готовности средние (средний балл от 2,50 до 3,19) "]
["2 уровень -   показатели готовности ниже средних (средний балл от 2,0 до 2,49)"]
[" 1 уровень - низкие показатели готовности (средний балл менее 2) "]

{"sheet":"Лист9","index":8,"n_rows":79,"n_cols":11,"rows_kept":79,"merged":[[0,0,0,10],[43,0,43,10],[44,0,44,10],[45,0,45,10],[46,0,46,10],[48,0,48,10],[75,0,75,10],[76,0,76,10],[77,0,77,10],[78,0,78,10]]}
["Итоги групповой диагностики   обучающихся (воспитанников) ОУ______________ _________"]
[null,91,92,93,94,95,96,97,98,99,100]
["Фамилия, имя ребенка"]
["Дата рождения"]
["I. Зрительно-моторная координация"]
["узор №1"]
["графомоторные навыки"]
["установление закономерностей"]
["узор №2"]
["графомоторные навыки"]
["установление закономерностей"]
["узор №3"]
["графомоторные навыки"]
["установление закономерностей"]
["самоконтроль "]
["II. Математические представления"]
["Счет"]
["Сравнение"]
["Приведение к равенству"]
["III. Мыслительные процессы"]
["Классификация"]
["Исключение лишнего"]
["IV. Звукобуквенный анализ, синтез, фонематическое восприятие"]
["Звукобуквенный анализ"]
["Фонематическое восприятие"]
["Звуковой синтез"]
["V. Саморегуляция и организация деятельности"]
["Саморегуляция"]
["самоконтроль "]
["VI. Внимание"]
["Пробы на внимание"]
[]
[null,{"$f":"B3","v":0},{"$f":"C3","v":0},{"$f":"D3","v":0},{"$f":"E3","v":0},0,0,0,0,0,0]
["I. Зрительно-моторная координация",{"$f":"(B7+B10+B13)/3","v":{"v":0,"d":"0.00"}},{"v":0,"d":"0.00"},{"v":0,"d":"0.00"},{"v":0,"d":"0.00"},{"v":0,"d":"0.00"},{"v":0,"d":"0.00"},{"v":0,"d":"0.00"},{"v":0,"d":"0.00"},{"v":0,"d":"0.00"},{"v":0,"d":"0.00"}]
["II. Математические представления",{"$f":"(B17+B18+B19)/3","v":{"v":0,"d":"0.00"}},{"$f":"(C17+C18+C19)/3","v":{"v":0,"d":"0.00"}},{"v":0,"d":"0.00"},{"v":0,"d":"0.00"},{"v":0,"d":"0.00"},{"v":0,"d":"0.00"},{"v":0,"d":"0.00"},{"v":0,"d":"0.00"},{"v":0,"d":"0.00"},{"v":0,"d":"0.00"}]
["III. Мыслительные процессы",{"$f":"(B8+B11+B14+B21+B22)/5","v":{"v":0,"d":"0.00"}},{"v":0,"d":"0.00"},{"v":0,"d":"0.00"},{"v":0,"d":"0.00"},{"v":0,"d":"0.00"},{"v":0,"d":"0.00"},{"v":0,"d":"0.00"},{"v":0,"d":"0.00"},{"v":0,"d":"0.00"},{"v":0,"d":"0.00"}]
["IV. Звукобуквенный анализ, синтез, фонематическое восприятие",{"$f":"(B24+B25+B26)/3","v":{"v":0,"d":"0.00"}},{"$f":"(C24+C25+C26)/3","v":{"v":0,"d":"0.00"}},{"$f":"(D24+D25+D26)/3","v":{"v":0,"d":"0.00"}},{"v":0,"d":"0.00"},{"v":0,"d":"0.00"},{"v":0,"d":"0.00"},{"v":0,"d":"0.00"},{"v":0,"d":"0.00"},{"v":0,"d":"0.00"},{"v":0,"d":"0.00"}]
["V. Саморегуляция и организация деятельности",{"$f":"(B15+B28+B29)/3","v":{"v":0,"d":"0.00"}},{"$f":"(C15+C28+C29)/3","v":{"v":0,"d":"0.00"}},{"v":0,"d":"0.00"},{"v":0,"d":"0.00"},{"v":0,"d":"0.00"},{"v":0,"d":"0.00"},{"v":0,"d":"0.00"},{"v":0,"d":"0.00"},{"v":0,"d":"0.00"},{"v":0,"d":"0.00"}]
["VI. Внимание",{"$f":"B31","v":{"v":0,"d":"0.00"}},{"$f":"C31","v":{"v":0,"d":"0.00"}},{"v":0,"d":"0.00"},{"v":0,"d":"0.00"},{"v":0,"d":"0.00"},{"v":0,"d":"0.00"},{"v":0,"d":"0.00"},{"v":0,"d":"0.00"},{"v":0,"d":"0.00"},{"v":0,"d":"0.00"}]
["ИТОГО",{"$f":"(B34+B35+B36+B37+B38+B39)/6","v":{"v":0,"d":"0.00"}},{"v":0,"d":"0.00"},{"v":0,"d":"0.00"},{"v":0,"d":"0.00"},{"v":0,"d":"0.00"},{"v":0,"d":"0.00"},{"v":0,"d":"0.00"},{"v":0,"d":"0.00"},{"v":0,"d":"0.00"},{"v":0,"d":"0.00"}]
[null,{"$f":"IF(B40>3.19,\"IV уровень\",IF(AND(B40<=3.19,B40>=2.5),\"III уровень\",IF(AND(B40<2.5,B40>=2),\"II уровень\",IF(AND(B40<1.99),\"I уровень\"))))","v":"I уровень"},{"$f":"IF(C40>3.19,\"IV уровень\",IF(AND(C40<=3.19,C40>=2.5),\"III уровень\",IF(AND(C40<2.5,C40>=2),\"II уровень\",IF(AND(C40<1.99),\"I уровень\"))))","v":"I уровень"},"I уровень","I уровень","I уровень","I уровень","I уровень","I уровень","I уровень","I уровень"]
[]
[]
["4 уровень - высокие показатели состояния ВПФ и процессов (средний балл от 3,2 до 4,0) - ребенок не нуждается в проведении специальных коррекционных мероприятий."]
["3 уровень - показатели   средние (средний балл от 2,5 до 3,19) - ребенок не нуждается в проведении специальных коррекционных мероприятий, однако педагогом могут быть даны рекомендации по развивающей работе."]
["2 уровень -   показатели ниже средних (средний балл от 2,0 до 2,49) - ребенок нуждается в проведении специальных коррекционных мероприятий в виде групповых  и индивидуальных занятий."]
[" 1 уровень - низкие показатели(средний балл менее 2) - ребенок нуждается в проведении специальных коррекционных мероприятий в виде индивидуальных занятий."]
[]
[{"$f":"A1","v":"Итоги групповой диагностики   обучающихся (воспитанников) ОУ______________ _________"}]
[null,{"$f":"B2","v":91},92,93,94,95,96,97,98,99,100]
["Фамилия, имя ребенка",{"$f":"B3","v":0},{"$f":"C3","v":0},0,0,0,0,0,0,0,0]
["Дата рождения",{"$f":"B4","v":"00:00:00"},{"$f":"C4","v":"00:00:00"},"00:00:00","00:00:00","00:00:00","00:00:00","00:00:00","00:00:00","00:00:00","00:00:00"]
["сформированность регуляторного компонента деятельности "]
["Задание 1",{"$f":"B31","v":{"v":0,"d":"0.00"}},{"$f":"C31","v":{"v":0,"d":"0.00"}},{"$f":"D31","v":{"v":0,"d":"0.00"}},{"v":0,"d":"0.00"},{"v":0,"d":"0.00"},{"v":0,"d":"0.00"},{"v":0,"d":"0.00"},{"v":0,"d":"0.00"},{"v":0,"d":"0.00"},{"v":0,"d":"0.00"}]
["Задание 3",{"$f":"(B28+B29)/2","v":{"v":0,"d":"0.00"}},{"$f":"(C28+C29)/2","v":{"v":0,"d":"0.00"}},{"$f":"(D28+D29)/2","v":{"v":0,"d":"0.00"}},{"v":0,"d":"0.00"},{"v":0,"d":"0.00"},{"v":0,"d":"0.00"},{"v":0,"d":"0.00"},{"v":0,"d":"0.00"},{"v":0,"d":"0.00"},{"v":0,"d":"0.00"}]
["Задание 4",{"$f":"B15","v":{"v":0,"d":"0.00"}},{"$f":"C15","v":{"v":0,"d":"0.00"}},{"$f":"D15","v":{"v":0,"d":"0.00"}},{"v":0,"d":"0.00"},{"v":0,"d":"0.00"},{"v":0,"d":"0.00"},{"v":0,"d":"0.00"},{"v":0,"d":"0.00"},{"v":0,"d":"0.00"},{"v":0,"d":"0.00"}]
["Задание 5",{"$f":"B19","v":{"v":0,"d":"0.00"}},{"$f":"C19","v":{"v":0,"d":"0.00"}},{"$f":"D19","v":{"v":0,"d":"0.00"}},{"v":0,"d":"0.00"},{"v":0,"d":"0.00"},{"v":0,"d":"0.00"},{"v":0,"d":"0.00"},{"v":0,"d":"0.00"},{"v":0,"d":"0.00"},{"v":0,"d":"0.00"}]
["сформированность предпосылок к учебной деятельности"]
["Задание 2",{"$f":"B26","v":{"v":0,"d":"0.00"}},{"$f":"C26","v":{"v":0,"d":"0.00"}},{"$f":"D26","v":{"v":0,"d":"0.00"}},{"v":0,"d":"0.00"},{"v":0,"d":"0.00"},{"v":0,"d":"0.00"},{"v":0,"d":"0.00"},{"v":0,"d":"0.00"},{"v":0,"d":"0.00"},{"v":0,"d":"0.00"}]
["Задание 5",{"$f":"B35","v":{"v":0,"d":"0.00"}},{"$f":"C35","v":{"v":0,"d":"0.00"}},{"$f":"D35","v":{"v":0,"d":"0.00"}},{"v":0,"d":"0.00"},{"v":0,"d":"0.00"},{"v":0,"d":"0.00"},{"v":0,"d":"0.00"},{"v":0,"d":"0.00"},{"v":0,"d":"0.00"},{"v":0,"d":"0.00"}]
["Задание 8",{"$f":"B24","v":{"v":0,"d":"0.00"}},{"$f":"C24","v":{"v":0,"d":"0.00"}},{"$f":"D24","v":{"v":0,"d":"0.00"}},{"v":0,"d":"0.00"},{"v":0,"d":"0.00"},{"v":0,"d":"0.00"},{"v":0,"d":"0.00"},{"v":0,"d":"0.00"},{"v":0,"d":"0.00"},{"v":0,"d":"0.00"}]
["Задание 9",{"$f":"B25","v":{"v":0,"d":"0.00"}},{"$f":"C25","v":{"v":0,"d":"0.00"}},{"v":0,"d":"0.00"},{"v":0,"d":"0.00"},{"v":0,"d":"0.00"},{"v":0,"d":"0.00"},{"v":0,"d":"0.00"},{"v":0,"d":"0.00"},{"v":0,"d":"0.00"},{"v":0,"d":"0.00"}]
["сформированности пространственных представлений"]
["Задание 4",{"$f":"(B7+B10+B13)/3","v":{"v":0,"d":"0.00"}},{"$f":"(C7+C10+C13)/3","v":{"v":0,"d":"0.00"}},{"$f":"(D7+D10+D13)/3","v":{"v":0,"d":"0.00"}},{"v":0,"d":"0.00"},{"v":0,"d":"0.00"},{"v":0,"d":"0.00"},{"v":0,"d":"0.00"},{"v":0,"d":"0.00"},{"v":0,"d":"0.00"},{"v":0,"d":"0.00"}]
["особенности мыслительной деятельности "]
["Задание 4 (закономерности)",{"$f":"(B8+B11+B14)/3","v":{"v":0,"d":"0.00"}},{"$f":"(C8+C11+C14)/3","v":{"v":0,"d":"0.00"}},{"$f":"(D8+D11+D14)/3","v":{"v":0,"d":"0.00"}},{"v":0,"d":"0.00"},{"v":0,"d":"0.00"},{"v":0,"d":"0.00"},{"v":0,"d":"0.00"},{"v":0,"d":"0.00"},{"v":0,"d":"0.00"},{"v":0,"d":"0.00"}]
["Задание 6",{"$f":"B21","v":{"v":0,"d":"0.00"}},{"$f":"C21","v":{"v":0,"d":"0.00"}},{"$f":"D21","v":{"v":0,"d":"0.00"}},{"v":0,"d":"0.00"},{"v":0,"d":"0.00"},{"v":0,"d":"0.00"},{"v":0,"d":"0.00"},{"v":0,"d":"0.00"},{"v":0,"d":"0.00"},{"v":0,"d":"0.00"}]
["Задание 7",{"$f":"B22","v":{"v":0,"d":"0.00"}},{"$f":"C22","v":{"v":0,"d":"0.00"}},{"v":0,"d":"0.00"},{"v":0,"d":"0.00"},{"v":0,"d":"0.00"},{"v":0,"d":"0.00"},{"v":0,"d":"0.00"},{"v":0,"d":"0.00"},{"v":0,"d":"0.00"},{"v":0,"d":"0.00"}]
[]
["сформированность регуляторного компонента деятельности ",{"$f":"(B54+B28+B29+B56+B57)/5","v":{"v":0,"d":"0.00"}},{"$f":"(C54+C28+C29+C56+C57)/5","v":{"v":0,"d":"0.00"}},{"$f":"(D54+D28+D29+D56+D57)/5","v":{"v":0,"d":"0.00"}},{"v":0,"d":"0.00"},{"v":0,"d":"0.00"},{"v":0,"d":"0.00"},{"v":0,"d":"0.00"},{"v":0,"d":"0.00"},{"v":0,"d":"0.00"},{"v":0,"d":"0.00"}]
["сформированность предпосылок к учебной деятельности",{"$f":"(B59+B17+B18+B19+B61+B62)/6","v":{"v":0,"d":"0.00"}},{"$f":"(C59+C17+C18+C19+C61+C62)/6","v":{"v":0,"d":"0.00"}},{"$f":"(D59+D17+D18+D19+D61+D62)/6","v":{"v":0,"d":"0.00"}},{"v":0,"d":"0.00"},{"v":0,"d":"0.00"},{"v":0,"d":"0.00"},{"v":0,"d":"0.00"},{"v":0,"d":"0.00"},{"v":0,"d":"0.00"},{"v":0,"d":"0.00"}]
["сформированности пространственных представлений",{"$f":"B64","v":{"v":0,"d":"0.00"}},{"$f":"C64","v":{"v":0,"d":"0.00"}},{"$f":"D64","v":{"v":0,"d":"0.00"}},{"v":0,"d":"0.00"},{"v":0,"d":"0.00"},{"v":0,"d":"0.00"},{"v":0,"d":"0.00"},{"v":0,"d":"0.00"},{"v":0,"d":"0.00"},{"v":0,"d":"0.00"}]
["особенности мыслительной деятельности ",{"$f":"(B8+B11+B14+B21+B22)/5","v":{"v":0,"d":"0.00"}},{"$f":"(C8+C11+C14+C21+C22)/5","v":{"v":0,"d":"0.00"}},{"$f":"(D8+D11+D14+D21+D22)/5","v":{"v":0,"d":"0.00"}},{"v":0,"d":"0.00"},{"v":0,"d":"0.00"},{"v":0,"d":"0.00"},{"v":0,"d":"0.00"},{"v":0,"d":"0.00"},{"v":0,"d":"0.00"},{"v":0,"d":"0.00"}]
[null,{"$f":"(B70+B71+B72+B73)/4","v":{"v":0,"d":"0.00"}},{"$f":"(C70+C71+C72+C73)/4","v":{"v":0,"d":"0.00"}},{"$f":"(D70+D71+D72+D73)/4","v":{"v":0,"d":"0.00"}},{"v":0,"d":"0.00"},{"v":0,"d":"0.00"},{"v":0,"d":"0.00"},{"v":0,"d":"0.00"},{"v":0,"d":"0.00"},{"v":0,"d":"0.00"},{"v":0,"d":"0.00"}]
[null,{"$f":"IF(B74>3.19,\"готов\",IF(AND(B74<=3.19,B74>=2.5),\"готов\",IF(AND(B74<2.5,B74>=2),\"частично готов\",IF(AND(B74<2),\"не готов\"))))","v":"не готов"},{"$f":"IF(C74>3.19,\"готов\",IF(AND(C74<=3.19,C74>=2.5),\"готов\",IF(AND(C74<2.5,C74>=2),\"частично готов\",IF(AND(C74<2),\"не готов\"))))","v":"не готов"},"не готов","не готов","не готов","не готов","не готов","не готов","не готов","не готов"]
["4 уровень - высокие показатели готовности(средний балл от 3,2 до 4,0)"]
["3 уровень - показатели   готовности средние (средний балл от 2,50 до 3,19) "]
["2 уровень -   показатели готовности ниже средних (средний балл от 2,0 до 2,49)"]
[" 1 уровень - низкие показатели готовности (средний балл менее 2) "]

{"sheet":"Лист10","index":9,"n_rows":79,"n_cols":11,"rows_kept":79,"merged":[[0,0,0,10],[43,0,43,10],[44,0,44,10],[45,0,45,10],[46,0,46,10],[48,0,48,10],[75,0,75,10],[76,0,76,10],[77,0,77,10],[78,0,78,10]]}
["Итоги групповой диагностики   обучающихся (воспитанников) ОУ______________ _________"]
[null,101,102,103,104,105,106,107,108,109,110]
["Фамилия, имя ребенка"]
["Дата рождения"]
["I. Зрительно-моторная координация"]
["узор №1"]
["графомоторные навыки"]
["установление закономерностей"]
["узор №2"]
["графомоторные навыки"]
["установление закономерностей"]
["узор №3"]
["графомоторные навыки"]
["установление закономерностей"]
["самоконтроль "]
["II. Математические представления"]
["Счет"]
["Сравнение"]
["Приведение к равенству"]
["III. Мыслительные процессы"]
["Классификация"]
["Исключение лишнего"]
["IV. Звукобуквенный анализ, синтез, фонематическое восприятие"]
["Звукобуквенный анализ"]
["Фонематическое восприятие"]
["Звуковой синтез"]
["V. Саморегуляция и организация деятельности"]
["Саморегуляция"]
["самоконтроль "]
["VI. Внимание"]
["Пробы на внимание"]
[]
[null,{"$f":"B3","v":0},{"$f":"C3","v":0},{"$f":"D3","v":0},{"$f":"E3","v":0},0,0,0,0,0,0]
["I. Зрительно-моторная координация",{"$f":"(B7+B10+B13)/3","v":{"v":0,"d":"0.00"}},{"v":0,"d":"0.00"},{"v":0,"d":"0.00"},{"v":0,"d":"0.00"},{"v":0,"d":"0.00"},{"v":0,"d":"0.00"},{"v":0,"d":"0.00"},{"v":0,"d":"0.00"},{"v":0,"d":"0.00"},{"v":0,"d":"0.00"}]
["II. Математические представления",{"$f":"(B17+B18+B19)/3","v":{"v":0,"d":"0.00"}},{"$f":"(C17+C18+C19)/3","v":{"v":0,"d":"0.00"}},{"v":0,"d":"0.00"},{"v":0,"d":"0.00"},{"v":0,"d":"0.00"},{"v":0,"d":"0.00"},{"v":0,"d":"0.00"},{"v":0,"d":"0.00"},{"v":0,"d":"0.00"},{"v":0,"d":"0.00"}]
["III. Мыслительные процессы",{"$f":"(B8+B11+B14+B21+B22)/5","v":{"v":0,"d":"0.00"}},{"v":0,"d":"0.00"},{"v":0,"d":"0.00"},{"v":0,"d":"0.00"},{"v":0,"d":"0.00"},{"v":0,"d":"0.00"},{"v":0,"d":"0.00"},{"v":0,"d":"0.00"},{"v":0,"d":"0.00"},{"v":0,"d":"0.00"}]
["IV. Звукобуквенный анализ, синтез, фонематическое восприятие",{"$f":"(B24+B25+B26)/3","v":{"v":0,"d":"0.00"}},{"$f":"(C24+C25+C26)/3","v":{"v":0,"d":"0.00"}},{"$f":"(D24+D25+D26)/3","v":{"v":0,"d":"0.00"}},{"v":0,"d":"0.00"},{"v":0,"d":"0.00"},{"v":0,"d":"0.00"},{"v":0,"d":"0.00"},{"v":0,"d":"0.00"},{"v":0,"d":"0.00"},{"v":0,"d":"0.00"}]
["V. Саморегуляция и организация деятельности",{"$f":"(B15+B28+B29)/3","v":{"v":0,"d":"0.00"}},{"$f":"(C15+C28+C29)/3","v":{"v":0,"d":"0.00"}},{"v":0,"d":"0.00"},{"v":0,"d":"0.00"},{"v":0,"d":"0.00"},{"v":0,"d":"0.00"},{"v":0,"d":"0.00"},{"v":0,"d":"0.00"},{"v":0,"d":"0.00"},{"v":0,"d":"0.00"}]
["VI. Внимание",{"$f":"B31","v":{"v":0,"d":"0.00"}},{"$f":"C31","v":{"v":0,"d":"0.00"}},{"v":0,"d":"0.00"},{"v":0,"d":"0.00"},{"v":0,"d":"0.00"},{"v":0,"d":"0.00"},{"v":0,"d":"0.00"},{"v":0,"d":"0.00"},{"v":0,"d":"0.00"},{"v":0,"d":"0.00"}]
["ИТОГО",{"$f":"(B34+B35+B36+B37+B38+B39)/6","v":{"v":0,"d":"0.00"}},{"v":0,"d":"0.00"},{"v":0,"d":"0.00"},{"v":0,"d":"0.00"},{"v":0,"d":"0.00"},{"v":0,"d":"0.00"},{"v":0,"d":"0.00"},{"v":0,"d":"0.00"},{"v":0,"d":"0.00"},{"v":0,"d":"0.00"}]
[null,{"$f":"IF(B40>3.19,\"IV уровень\",IF(AND(B40<=3.19,B40>=2.5),\"III уровень\",IF(AND(B40<2.5,B40>=2),\"II уровень\",IF(AND(B40<1.99),\"I уровень\"))))","v":"I уровень"},{"$f":"IF(C40>3.19,\"IV уровень\",IF(AND(C40<=3.19,C40>=2.5),\"III уровень\",IF(AND(C40<2.5,C40>=2),\"II уровень\",IF(AND(C40<1.99),\"I уровень\"))))","v":"I уровень"},"I уровень","I уровень","I уровень","I уровень","I уровень","I уровень","I уровень","I уровень"]
[]
[]
["4 уровень - высокие показатели состояния ВПФ и процессов (средний балл от 3,2 до 4,0) - ребенок не нуждается в проведении специальных коррекционных мероприятий."]
["3 уровень - показатели   средние (средний балл от 2,5 до 3,19) - ребенок не нуждается в проведении специальных коррекционных мероприятий, однако педагогом могут быть даны рекомендации по развивающей работе."]
["2 уровень -   показатели ниже средних (средний балл от 2,0 до 2,49) - ребенок нуждается в проведении специальных коррекционных мероприятий в виде групповых  и индивидуальных занятий."]
[" 1 уровень - низкие показатели(средний балл менее 2) - ребенок нуждается в проведении специальных коррекционных мероприятий в виде индивидуальных занятий."]
[]
[{"$f":"A1","v":"Итоги групповой диагностики   обучающихся (воспитанников) ОУ______________ _________"}]
[null,{"$f":"B2","v":101},102,103,104,105,106,107,108,109,110]
["Фамилия, имя ребенка",{"$f":"B3","v":0},{"$f":"C3","v":0},0,0,0,0,0,0,0,0]
["Дата рождения",{"$f":"B4","v":"00:00:00"},{"$f":"C4","v":"00:00:00"},"00:00:00","00:00:00","00:00:00","00:00:00","00:00:00","00:00:00","00:00:00","00:00:00"]
["сформированность регуляторного компонента деятельности "]
["Задание 1",{"$f":"B31","v":{"v":0,"d":"0.00"}},{"$f":"C31","v":{"v":0,"d":"0.00"}},{"$f":"D31","v":{"v":0,"d":"0.00"}},{"v":0,"d":"0.00"},{"v":0,"d":"0.00"},{"v":0,"d":"0.00"},{"v":0,"d":"0.00"},{"v":0,"d":"0.00"},{"v":0,"d":"0.00"},{"v":0,"d":"0.00"}]
["Задание 3",{"$f":"(B28+B29)/2","v":{"v":0,"d":"0.00"}},{"$f":"(C28+C29)/2","v":{"v":0,"d":"0.00"}},{"$f":"(D28+D29)/2","v":{"v":0,"d":"0.00"}},{"v":0,"d":"0.00"},{"v":0,"d":"0.00"},{"v":0,"d":"0.00"},{"v":0,"d":"0.00"},{"v":0,"d":"0.00"},{"v":0,"d":"0.00"},{"v":0,"d":"0.00"}]
["Задание 4",{"$f":"B15","v":{"v":0,"d":"0.00"}},{"$f":"C15","v":{"v":0,"d":"0.00"}},{"$f":"D15","v":{"v":0,"d":"0.00"}},{"v":0,"d":"0.00"},{"v":0,"d":"0.00"},{"v":0,"d":"0.00"},{"v":0,"d":"0.00"},{"v":0,"d":"0.00"},{"v":0,"d":"0.00"},{"v":0,"d":"0.00"}]
["Задание 5",{"$f":"B19","v":{"v":0,"d":"0.00"}},{"$f":"C19","v":{"v":0,"d":"0.00"}},{"$f":"D19","v":{"v":0,"d":"0.00"}},{"v":0,"d":"0.00"},{"v":0,"d":"0.00"},{"v":0,"d":"0.00"},{"v":0,"d":"0.00"},{"v":0,"d":"0.00"},{"v":0,"d":"0.00"},{"v":0,"d":"0.00"}]
["сформированность предпосылок к учебной деятельности"]
["Задание 2",{"$f":"B26","v":{"v":0,"d":"0.00"}},{"$f":"C26","v":{"v":0,"d":"0.00"}},{"$f":"D26","v":{"v":0,"d":"0.00"}},{"v":0,"d":"0.00"},{"v":0,"d":"0.00"},{"v":0,"d":"0.00"},{"v":0,"d":"0.00"},{"v":0,"d":"0.00"},{"v":0,"d":"0.00"},{"v":0,"d":"0.00"}]
["Задание 5",{"$f":"B35","v":{"v":0,"d":"0.00"}},{"$f":"C35","v":{"v":0,"d":"0.00"}},{"$f":"D35","v":{"v":0,"d":"0.00"}},{"v":0,"d":"0.00"},{"v":0,"d":"0.00"},{"v":0,"d":"0.00"},{"v":0,"d":"0.00"},{"v":0,"d":"0.00"},{"v":0,"d":"0.00"},{"v":0,"d":"0.00"}]
["Задание 8",{"$f":"B24","v":{"v":0,"d":"0.00"}},{"$f":"C24","v":{"v":0,"d":"0.00"}},{"$f":"D24","v":{"v":0,"d":"0.00"}},{"v":0,"d":"0.00"},{"v":0,"d":"0.00"},{"v":0,"d":"0.00"},{"v":0,"d":"0.00"},{"v":0,"d":"0.00"},{"v":0,"d":"0.00"},{"v":0,"d":"0.00"}]
["Задание 9",{"$f":"B25","v":{"v":0,"d":"0.00"}},{"$f":"C25","v":{"v":0,"d":"0.00"}},{"v":0,"d":"0.00"},{"v":0,"d":"0.00"},{"v":0,"d":"0.00"},{"v":0,"d":"0.00"},{"v":0,"d":"0.00"},{"v":0,"d":"0.00"},{"v":0,"d":"0.00"},{"v":0,"d":"0.00"}]
["сформированности пространственных представлений"]
["Задание 4",{"$f":"(B7+B10+B13)/3","v":{"v":0,"d":"0.00"}},{"$f":"(C7+C10+C13)/3","v":{"v":0,"d":"0.00"}},{"$f":"(D7+D10+D13)/3","v":{"v":0,"d":"0.00"}},{"v":0,"d":"0.00"},{"v":0,"d":"0.00"},{"v":0,"d":"0.00"},{"v":0,"d":"0.00"},{"v":0,"d":"0.00"},{"v":0,"d":"0.00"},{"v":0,"d":"0.00"}]
["особенности мыслительной деятельности "]
["Задание 4 (закономерности)",{"$f":"(B8+B11+B14)/3","v":{"v":0,"d":"0.00"}},{"$f":"(C8+C11+C14)/3","v":{"v":0,"d":"0.00"}},{"$f":"(D8+D11+D14)/3","v":{"v":0,"d":"0.00"}},{"v":0,"d":"0.00"},{"v":0,"d":"0.00"},{"v":0,"d":"0.00"},{"v":0,"d":"0.00"},{"v":0,"d":"0.00"},{"v":0,"d":"0.00"},{"v":0,"d":"0.00"}]
["Задание 6",{"$f":"B21","v":{"v":0,"d":"0.00"}},{"$f":"C21","v":{"v":0,"d":"0.00"}},{"$f":"D21","v":{"v":0,"d":"0.00"}},{"v":0,"d":"0.00"},{"v":0,"d":"0.00"},{"v":0,"d":"0.00"},{"v":0,"d":"0.00"},{"v":0,"d":"0.00"},{"v":0,"d":"0.00"},{"v":0,"d":"0.00"}]
["Задание 7",{"$f":"B22","v":{"v":0,"d":"0.00"}},{"$f":"C22","v":{"v":0,"d":"0.00"}},{"v":0,"d":"0.00"},{"v":0,"d":"0.00"},{"v":0,"d":"0.00"},{"v":0,"d":"0.00"},{"v":0,"d":"0.00"},{"v":0,"d":"0.00"},{"v":0,"d":"0.00"},{"v":0,"d":"0.00"}]
[]
["сформированность регуляторного компонента деятельности ",{"$f":"(B54+B28+B29+B56+B57)/5","v":{"v":0,"d":"0.00"}},{"$f":"(C54+C28+C29+C56+C57)/5","v":{"v":0,"d":"0.00"}},{"$f":"(D54+D28+D29+D56+D57)/5","v":{"v":0,"d":"0.00"}},{"v":0,"d":"0.00"},{"v":0,"d":"0.00"},{"v":0,"d":"0.00"},{"v":0,"d":"0.00"},{"v":0,"d":"0.00"},{"v":0,"d":"0.00"},{"v":0,"d":"0.00"}]
["сформированность предпосылок к учебной деятельности",{"$f":"(B59+B17+B18+B19+B61+B62)/6","v":{"v":0,"d":"0.00"}},{"$f":"(C59+C17+C18+C19+C61+C62)/6","v":{"v":0,"d":"0.00"}},{"$f":"(D59+D17+D18+D19+D61+D62)/6","v":{"v":0,"d":"0.00"}},{"v":0,"d":"0.00"},{"v":0,"d":"0.00"},{"v":0,"d":"0.00"},{"v":0,"d":"0.00"},{"v":0,"d":"0.00"},{"v":0,"d":"0.00"},{"v":0,"d":"0.00"}]
["сформированности пространственных представлений",{"$f":"B64","v":{"v":0,"d":"0.00"}},{"$f":"C64","v":{"v":0,"d":"0.00"}},{"$f":"D64","v":{"v":0,"d":"0.00"}},{"v":0,"d":"0.00"},{"v":0,"d":"0.00"},{"v":0,"d":"0.00"},{"v":0,"d":"0.00"},{"v":0,"d":"0.00"},{"v":0,"d":"0.00"},{"v":0,"d":"0.00"}]
["особенности мыслительной деятельности ",{"$f":"(B8+B11+B14+B21+B22)/5","v":{"v":0,"d":"0.00"}},{"$f":"(C8+C11+C14+C21+C22)/5","v":{"v":0,"d":"0.00"}},{"$f":"(D8+D11+D14+D21+D22)/5","v":{"v":0,"d":"0.00"}},{"v":0,"d":"0.00"},{"v":0,"d":"0.00"},{"v":0,"d":"0.00"},{"v":0,"d":"0.00"},{"v":0,"d":"0.00"},{"v":0,"d":"0.00"},{"v":0,"d":"0.00"}]
[null,{"$f":"(B70+B71+B72+B73)/4","v":{"v":0,"d":"0.00"}},{"$f":"(C70+C71+C72+C73)/4","v":{"v":0,"d":"0.00"}},{"$f":"(D70+D71+D72+D73)/4","v":{"v":0,"d":"0.00"}},{"v":0,"d":"0.00"},{"v":0,"d":"0.00"},{"v":0,"d":"0.00"},{"v":0,"d":"0.00"},{"v":0,"d":"0.00"},{"v":0,"d":"0.00"},{"v":0,"d":"0.00"}]
[null,{"$f":"IF(B74>3.19,\"готов\",IF(AND(B74<=3.19,B74>=2.5),\"готов\",IF(AND(B74<2.5,B74>=2),\"частично готов\",IF(AND(B74<2),\"не готов\"))))","v":"не готов"},{"$f":"IF(C74>3.19,\"готов\",IF(AND(C74<=3.19,C74>=2.5),\"готов\",IF(AND(C74<2.5,C74>=2),\"частично готов\",IF(AND(C74<2),\"не готов\"))))","v":"не готов"},"не готов","не готов","не готов","не готов","не готов","не готов","не готов","не готов"]
["4 уровень - высокие показатели готовности(средний балл от 3,2 до 4,0)"]
["3 уровень - показатели   готовности средние (средний балл от 2,50 до 3,19) "]
["2 уровень -   показатели готовности ниже средних (средний балл от 2,0 до 2,49)"]
[" 1 уровень - низкие показатели готовности (средний балл менее 2) "]